irc-client

IRC client library

Error log

The package failed to build. The error log from opam follows.

# Detecting depexts using vars: arch=x86_64, os=linux, os-distribution=debian, os-family=debian
# No extra OS packages requirements found.
# All required OS packages found.
# Now letting opam install the packages
[NOTE] Package ocamlfind is already installed (current version is 1.9.5).
[NOTE] Package dune is already installed (current version is 1.11.4).
The following actions will be performed:
  - install seq          0.2.2
  - install base-bytes   base
  - install obuild       0.1.10
  - install stdlib-shims 0.3.0
  - install ounit2       2.2.6
  - install ounit        2.2.6
  - install irc-client   0.1.1
===== 7 to install =====

<><> Gathering sources ><><><><><><><><><><><><><><><><><><><><><><><><><><><><>
Processing  2/7: [irc-client.0.1.1: http]
[obuild.0.1.10] found in cache
Processing  3/7: [irc-client.0.1.1: http]
[ounit.2.2.6] found in cache
Processing  4/7: [irc-client.0.1.1: http]
[ounit2.2.2.6] found in cache
Processing  5/7: [irc-client.0.1.1: http]
[seq.0.2.2] found in cache
Processing  6/7: [irc-client.0.1.1: http]
[stdlib-shims.0.3.0] found in cache
Processing  7/7: [irc-client.0.1.1: http]
[irc-client.0.1.1] downloaded from https://github.com/johnelse/ocaml-irc-client/archive/0.1.1.tar.gz
Processing  7/7:

<><> Processing actions <><><><><><><><><><><><><><><><><><><><><><><><><><><><>
Processing  2/14: [obuild: ./bootstrap]
Processing  3/14: [obuild: ./bootstrap] [seq: dune build]
Processing  4/14: [obuild: ./bootstrap] [seq: dune build] [stdlib-shims: dune build]
-> installed base-bytes.base
Processing  5/14: [obuild: ./bootstrap] [seq: dune build] [stdlib-shims: dune build]
+ /home/opam/.opam/4.05/bin/dune "build" "-p" "seq" "-j" "31" (CWD=/home/opam/.opam/4.05/.opam-switch/build/seq.0.2.2)
-> compiled  seq.0.2.2
Processing  5/14: [obuild: ./bootstrap] [stdlib-shims: dune build]
-> installed seq.0.2.2
Processing  6/14: [obuild: ./bootstrap] [stdlib-shims: dune build]
+ /home/opam/.opam/4.05/bin/dune "build" "-p" "stdlib-shims" "-j" "31" (CWD=/home/opam/.opam/4.05/.opam-switch/build/stdlib-shims.0.3.0)
-> compiled  stdlib-shims.0.3.0
Processing  6/14: [obuild: ./bootstrap]
-> installed stdlib-shims.0.3.0
Processing  7/14: [obuild: ./bootstrap]
Processing  8/14: [obuild: ./bootstrap] [ounit2: dune build]
+ /home/opam/.opam/4.05/.opam-switch/build/obuild.0.1.10/./bootstrap  (CWD=/home/opam/.opam/4.05/.opam-switch/build/obuild.0.1.10)
- 4.05.0
- Using compat402.ml
- COMPILING compat
- COMPILING fugue
- COMPILING filepath
- COMPILING filesystem
- BUILDING library obuild_ext.cmxa
- COMPILING types
- COMPILING gconf
- COMPILING filetype
- COMPILING dag
- COMPILING libname
- COMPILING pp
- File "pp.ml", line 13, characters 26-42:
- Warning 3: deprecated: String.lowercase
- Use String.lowercase_ascii instead.
- COMPILING expr
- File "expr.ml", line 129, characters 20-119:
- Warning 8: this pattern-matching is not exhaustive.
- Here is an example of a case that is not matched:
- (_::_::_::_|[])
- File "expr.ml", line 132, characters 23-134:
- Warning 8: this pattern-matching is not exhaustive.
- Here is an example of a case that is not matched:
- (_::_::_::_|[])
- COMPILING utils
- COMPILING modname
- File "modname.ml", line 22, characters 12-26:
- Warning 3: deprecated: Char.uppercase
- Use Char.uppercase_ascii instead.
- File "modname.ml", line 27, characters 15-34:
- Warning 3: deprecated: String.uncapitalize
- Use String.uncapitalize_ascii instead.
- File "modname.ml", line 28, characters 27-46:
- Warning 3: deprecated: String.uncapitalize
- Use String.uncapitalize_ascii instead.
- File "modname.ml", line 47, characters 34-51:
- Warning 3: deprecated: String.capitalize
- Use String.capitalize_ascii instead.
- File "modname.ml", line 49, characters 12-29:
- Warning 3: deprecated: String.capitalize
- Use String.capitalize_ascii instead.
- COMPILING taskdep
- COMPILING helper
- COMPILING dagutils
- COMPILING process
- COMPILING findlibConf
- COMPILING scheduler
- COMPILING prog
- COMPILING dependencies
- COMPILING generators
- COMPILING hier
- File "hier.ml", line 88, characters 15-34:
- Warning 3: deprecated: String.uncapitalize
- Use String.uncapitalize_ascii instead.
- File "hier.ml", line 194, characters 28-45:
- Warning 3: deprecated: String.capitalize
- Use String.capitalize_ascii instead.
- COMPILING meta
- COMPILING metacache
- COMPILING target
- COMPILING dist
- COMPILING project
- File "project.ml", line 84, characters 8-24:
- Warning 3: deprecated: String.lowercase
- Use String.lowercase_ascii instead.
- File "project.ml", line 96, characters 53-70:
- Warning 3: deprecated: String.capitalize
- Use String.capitalize_ascii instead.
- File "project.ml", line 105, characters 10-26:
- Warning 3: deprecated: String.lowercase
- Use String.lowercase_ascii instead.
- File "project.ml", line 207, characters 15-31:
- Warning 3: deprecated: String.lowercase
- Use String.lowercase_ascii instead.
- File "project.ml", line 224, characters 13-29:
- Warning 3: deprecated: String.lowercase
- Use String.lowercase_ascii instead.
- File "project.ml", line 255, characters 17-33:
- Warning 3: deprecated: String.lowercase
- Use String.lowercase_ascii instead.
- File "project.ml", line 267, characters 13-29:
- Warning 3: deprecated: String.lowercase
- Use String.lowercase_ascii instead.
- File "project.ml", line 386, characters 13-29:
- Warning 3: deprecated: String.lowercase
- Use String.lowercase_ascii instead.
- File "project.ml", line 477, characters 15-31:
- Warning 3: deprecated: String.lowercase
- Use String.lowercase_ascii instead.
- File "project.ml", line 488, characters 14-30:
- Warning 3: deprecated: String.lowercase
- Use String.lowercase_ascii instead.
- COMPILING analyze
- File "analyze.ml", line 110, characters 23-39:
- Warning 3: deprecated: String.lowercase
- Use String.lowercase_ascii instead.
- COMPILING configure
- File "configure.ml", line 34, characters 57-73:
- Warning 3: deprecated: String.uppercase
- Use String.uppercase_ascii instead.
- COMPILING prepare
- File "prepare.ml", line 379, characters 10-113:
- Warning 8: this pattern-matching is not exhaustive.
- Here is an example of a case that is not matched:
- DirectoryEntry _
- COMPILING buildprogs
- COMPILING build
- COMPILING exception
- BUILDING library obuild.cmxa
- COMPILING sdist
- COMPILING doc
- COMPILING init
- File "init.ml", line 98, characters 45-62:
- Warning 3: deprecated: String.capitalize
- Use String.capitalize_ascii instead.
- COMPILING help
- COMPILING install
- COMPILING path_generated
- COMPILING main
- LINKING obuild.bootstrap
- Configuring obuild-0.1.9...
- [ 1 of 57] Compiling Ext.Compat                    
- [ 2 of 57] Compiling Ext.Fugue                     
- [ 3 of 57] Intfing Ext.Filepath                  
- [ 4 of 57] Compiling Ext.Filepath                  
- [ 5 of 57] Intfing Ext.Filesystem                
- [ 6 of 57] Compiling Ext.Filesystem                
- File "ext/filesystem.ml", line 18, characters 11-216:
- Warning 4: this pattern-matching is fragile.
- It will remain exhaustive when constructors are added to type Unix.file_kind.
- 
- [ 7 of 57] Packing Ext                           
- [ 8 of 57] Linking library dist/build/lib-obuild.ext/obuild_ext.cmxa
- [ 8 of 57] Linking library dist/build/lib-obuild.ext/obuild_ext.cmxs
- [ 8 of 57] Linking library dist/build/lib-obuild.ext/obuild_ext.cma
- [ 9 of 57] Checking dist/build/lib-obuild.ext
- [10 of 57] Compiling Obuild.Filetype               
- [11 of 57] Compiling Obuild.Gconf                  
- [12 of 57] Compiling Obuild.Pp                     
- [13 of 57] Compiling Obuild.Dag                    
- File "obuild/pp.ml", line 13, characters 26-42:
- Warning 3: deprecated: String.lowercase
- Use String.lowercase_ascii instead.
- 
- [14 of 57] Compiling Obuild.Expr                   
- [15 of 57] Compiling Obuild.Modname                
- File "obuild/expr.ml", line 129, characters 20-119:
- Warning 8: this pattern-matching is not exhaustive.
- Here is an example of a case that is not matched:
- (_::_::_::_|[])
- File "obuild/expr.ml", line 132, characters 23-134:
- Warning 8: this pattern-matching is not exhaustive.
- Here is an example of a case that is not matched:
- (_::_::_::_|[])
- File "obuild/expr.ml", line 216, characters 8-232:
- Warning 4: this pattern-matching is fragile.
- It will remain exhaustive when constructors are added to type Token.t.
- File "obuild/expr.ml", line 209, characters 4-849:
- Warning 4: this pattern-matching is fragile.
- It will remain exhaustive when constructors are added to type Token.t.
- File "obuild/expr.ml", line 233, characters 4-205:
- Warning 4: this pattern-matching is fragile.
- It will remain exhaustive when constructors are added to type Token.t.
- File "obuild/expr.ml", line 268, characters 2-232:
- Warning 4: this pattern-matching is fragile.
- It will remain exhaustive when constructors are added to type Token.t.
- 
- [16 of 57] Compiling Obuild.Types                  
- File "obuild/modname.ml", line 22, characters 12-26:
- Warning 3: deprecated: Char.uppercase
- Use Char.uppercase_ascii instead.
- File "obuild/modname.ml", line 27, characters 15-34:
- Warning 3: deprecated: String.uncapitalize
- Use String.uncapitalize_ascii instead.
- File "obuild/modname.ml", line 28, characters 27-46:
- Warning 3: deprecated: String.uncapitalize
- Use String.uncapitalize_ascii instead.
- File "obuild/modname.ml", line 47, characters 34-51:
- Warning 3: deprecated: String.capitalize
- Use String.capitalize_ascii instead.
- File "obuild/modname.ml", line 49, characters 12-29:
- Warning 3: deprecated: String.capitalize
- Use String.capitalize_ascii instead.
- 
- [17 of 57] Compiling Obuild.Taskdep                
- [18 of 57] Compiling Obuild.Libname                
- [19 of 57] Compiling Obuild.Utils                  
- [20 of 57] Compiling Obuild.Dagutils               
- [21 of 57] Compiling Obuild.Helper                 
- [22 of 57] Compiling Obuild.Process                
- File "obuild/process.ml", line 95, characters 2-193:
- Warning 4: this pattern-matching is fragile.
- It will remain exhaustive when constructors are added to type Unix.process_status.
- 
- [23 of 57] Compiling Obuild.Scheduler              
- [24 of 57] Compiling Obuild.FindlibConf            
- [25 of 57] Compiling Obuild.Prog                   
- [26 of 57] Compiling Obuild.Meta                   
- [27 of 57] Compiling Obuild.Generators             
- File "obuild/generators.ml", line 55, characters 10-101:
- Warning 4: this pattern-matching is fragile.
- It will remain exhaustive when constructors are added to type Filetype.t.
- 
- [28 of 57] Compiling Obuild.Dependencies           
- [29 of 57] Compiling Obuild.Hier                   
- File "obuild/meta.ml", line 129, characters 27-155:
- Warning 4: this pattern-matching is fragile.
- It will remain exhaustive when constructors are added to type Predicate.t.
- File "obuild/meta.ml", line 139, characters 29-147:
- Warning 4: this pattern-matching is fragile.
- It will remain exhaustive when constructors are added to type Predicate.t.
- File "obuild/meta.ml", line 315, characters 28-300:
- Warning 4: this pattern-matching is fragile.
- It will remain exhaustive when constructors are added to type t.
- File "obuild/meta.ml", line 324, characters 48-235:
- Warning 4: this pattern-matching is fragile.
- It will remain exhaustive when constructors are added to type t.
- File "obuild/meta.ml", line 330, characters 48-251:
- Warning 4: this pattern-matching is fragile.
- It will remain exhaustive when constructors are added to type t.
- File "obuild/meta.ml", line 321, characters 40-683:
- Warning 4: this pattern-matching is fragile.
- It will remain exhaustive when constructors are added to type t.
- File "obuild/meta.ml", line 347, characters 8-454:
- Warning 4: this pattern-matching is fragile.
- It will remain exhaustive when constructors are added to type t.
- File "obuild/meta.ml", line 361, characters 8-243:
- Warning 4: this pattern-matching is fragile.
- It will remain exhaustive when constructors are added to type t.
- File "obuild/meta.ml", line 370, characters 8-411:
- Warning 4: this pattern-matching is fragile.
- It will remain exhaustive when constructors are added to type t.
- File "obuild/meta.ml", line 382, characters 8-410:
- Warning 4: this pattern-matching is fragile.
- It will remain exhaustive when constructors are added to type t.
- File "obuild/meta.ml", line 394, characters 8-190:
- Warning 4: this pattern-matching is fragile.
- It will remain exhaustive when constructors are added to type t.
- File "obuild/meta.ml", line 401, characters 8-242:
- Warning 4: this pattern-matching is fragile.
- It will remain exhaustive when constructors are added to type t.
- File "obuild/meta.ml", line 410, characters 26-158:
- Warning 4: this pattern-matching is fragile.
- It will remain exhaustive when constructors are added to type t.
- File "obuild/meta.ml", line 415, characters 8-144:
- Warning 4: this pattern-matching is fragile.
- It will remain exhaustive when constructors are added to type t.
- File "obuild/meta.ml", line 421, characters 8-251:
- Warning 4: this pattern-matching is fragile.
- It will remain exhaustive when constructors are added to type t.
- File "obuild/meta.ml", line 337, characters 31-4646:
- Warning 4: this pattern-matching is fragile.
- It will remain exhaustive when constructors are added to type t.
- File "obuild/meta.ml", line 5, characters 0-11:
- Warning 33: unused open Helper.
- File "obuild/meta.ml", line 6, characters 0-10:
- Warning 33: unused open Gconf.
- 
- [30 of 57] Compiling Obuild.Metacache              
- File "obuild/metacache.ml", line 1, characters 0-9:
- Warning 33: unused open Meta.
- 
- File "obuild/hier.ml", line 88, characters 15-34:
- Warning 3: deprecated: String.uncapitalize
- Use String.uncapitalize_ascii instead.
- File "obuild/hier.ml", line 194, characters 28-45:
- Warning 3: deprecated: String.capitalize
- Use String.capitalize_ascii instead.
- File "obuild/hier.ml", line 3, characters 0-10:
- Warning 33: unused open Types.
- 
- [31 of 57] Compiling Obuild.Target                 
- [32 of 57] Compiling Obuild.Project                
- [33 of 57] Compiling Obuild.Dist                   
- File "obuild/project.ml", line 84, characters 8-24:
- Warning 3: deprecated: String.lowercase
- Use String.lowercase_ascii instead.
- File "obuild/project.ml", line 96, characters 53-70:
- Warning 3: deprecated: String.capitalize
- Use String.capitalize_ascii instead.
- File "obuild/project.ml", line 105, characters 10-26:
- Warning 3: deprecated: String.lowercase
- Use String.lowercase_ascii instead.
- File "obuild/project.ml", line 207, characters 15-31:
- Warning 3: deprecated: String.lowercase
- Use String.lowercase_ascii instead.
- File "obuild/project.ml", line 224, characters 13-29:
- Warning 3: deprecated: String.lowercase
- Use String.lowercase_ascii instead.
- File "obuild/project.ml", line 255, characters 17-33:
- Warning 3: deprecated: String.lowercase
- Use String.lowercase_ascii instead.
- File "obuild/project.ml", line 267, characters 13-29:
- Warning 3: deprecated: String.lowercase
- Use String.lowercase_ascii instead.
- File "obuild/project.ml", line 386, characters 13-29:
- Warning 3: deprecated: String.lowercase
- Use String.lowercase_ascii instead.
- File "obuild/project.ml", line 477, characters 15-31:
- Warning 3: deprecated: String.lowercase
- Use String.lowercase_ascii instead.
- File "obuild/project.ml", line 488, characters 14-30:
- Warning 3: deprecated: String.lowercase
- Use String.lowercase_ascii instead.
- 
- [34 of 57] Compiling Obuild.Analyze                
- File "obuild/analyze.ml", line 59, characters 8-94:
- Warning 4: this pattern-matching is fragile.
- It will remain exhaustive when constructors are added to type Target.Name.t.
- File "obuild/analyze.ml", line 110, characters 23-39:
- Warning 3: deprecated: String.lowercase
- Use String.lowercase_ascii instead.
- File "obuild/analyze.ml", line 184, characters 22-466:
- Warning 4: this pattern-matching is fragile.
- It will remain exhaustive when constructors are added to type Meta.Predicate.t.
- File "obuild/analyze.ml", line 208, characters 10-182:
- Warning 4: this pattern-matching is fragile.
- It will remain exhaustive when constructors are added to type Target.Name.t.
- 
- [35 of 57] Compiling Obuild.Configure              
- [36 of 57] Compiling Obuild.Prepare                
- File "obuild/configure.ml", line 34, characters 57-73:
- Warning 3: deprecated: String.uppercase
- Use String.uppercase_ascii instead.
- 
- File "obuild/prepare.ml", line 168, characters 8-93:
- Warning 4: this pattern-matching is fragile.
- It will remain exhaustive when constructors are added to type Analyze.dependency_tag.
- File "obuild/prepare.ml", line 218, characters 17-557:
- Warning 4: this pattern-matching is fragile.
- It will remain exhaustive when constructors are added to type Filetype.t.
- File "obuild/prepare.ml", line 379, characters 10-113:
- Warning 8: this pattern-matching is not exhaustive.
- Here is an example of a case that is not matched:
- DirectoryEntry _
- File "obuild/prepare.ml", line 489, characters 10-224:
- Warning 4: this pattern-matching is fragile.
- It will remain exhaustive when constructors are added to type compile_step.
- File "obuild/prepare.ml", line 552, characters 6-99:
- Warning 4: this pattern-matching is fragile.
- It will remain exhaustive when constructors are added to type Analyze.dep_type.
- File "obuild/prepare.ml", line 202, characters 9-16:
- Warning 27: unused variable srcPath.
- File "obuild/prepare.ml", line 233, characters 13-20:
- Warning 27: unused variable srcPath.
- File "obuild/prepare.ml", line 239, characters 37-41:
- Warning 27: unused variable path.
- 
- [37 of 57] Compiling Obuild.Buildprogs             
- File "obuild/buildprogs.ml", line 69, characters 14-206:
- Warning 4: this pattern-matching is fragile.
- It will remain exhaustive when constructors are added to type Filetype.t.
- File "obuild/buildprogs.ml", line 66, characters 17-23:
- Warning 27: unused variable srcDir.
- 
- [38 of 57] Compiling Obuild.Build                  
- File "obuild/build.ml", line 60, characters 45-688:
- Warning 4: this pattern-matching is fragile.
- It will remain exhaustive when constructors are added to type Filetype.t.
- File "obuild/build.ml", line 59, characters 4-1138:
- Warning 4: this pattern-matching is fragile.
- It will remain exhaustive when constructors are added to type Filetype.t.
- File "obuild/build.ml", line 89, characters 6-63:
- Warning 4: this pattern-matching is fragile.
- It will remain exhaustive when constructors are added to type Types.ocaml_compiled_type.
- File "obuild/build.ml", line 89, characters 6-63:
- Warning 4: this pattern-matching is fragile.
- It will remain exhaustive when constructors are added to type Types.ocaml_compilation_option.
- File "obuild/build.ml", line 150, characters 20-196:
- Warning 4: this pattern-matching is fragile.
- It will remain exhaustive when constructors are added to type Hier.file_entry.
- File "obuild/build.ml", line 349, characters 22-124:
- Warning 4: this pattern-matching is fragile.
- It will remain exhaustive when constructors are added to type Types.ocaml_compilation_option.
- File "obuild/build.ml", line 360, characters 13-458:
- Warning 4: this pattern-matching is fragile.
- It will remain exhaustive when constructors are added to type Target.Name.t.
- File "obuild/build.ml", line 481, characters 40-160:
- Warning 4: this pattern-matching is fragile.
- It will remain exhaustive when constructors are added to type Prepare.compile_step.
- 
- [39 of 57] Compiling Obuild.Exception              
- [40 of 57] Packing Obuild                        
- [41 of 57] Linking library dist/build/lib-obuild/obuild.cmxa
- [41 of 57] Linking library dist/build/lib-obuild/obuild.cmxs
- [41 of 57] Linking library dist/build/lib-obuild/obuild.cma
- [42 of 57] Checking dist/build/lib-obuild
- [43 of 57] Compiling Assimilate_oasis              
- [44 of 57] Compiling Simple                        
- [45 of 57] Compiling Install                       
- [46 of 57] Compiling Doc                           
- File "src/install.ml", line 21, characters 6-264:
- Warning 4: this pattern-matching is fragile.
- It will remain exhaustive when constructors are added to type Obuild.Filetype.t.
- File "src/install.ml", line 27, characters 4-116:
- Warning 4: this pattern-matching is fragile.
- It will remain exhaustive when constructors are added to type Obuild.Filetype.t.
- File "src/install.ml", line 43, characters 31-137:
- Warning 4: this pattern-matching is fragile.
- It will remain exhaustive when constructors are added to type Obuild.Target.Name.t.
- File "src/install.ml", line 47, characters 31-137:
- Warning 4: this pattern-matching is fragile.
- It will remain exhaustive when constructors are added to type Obuild.Target.Name.t.
- 
- [47 of 57] Compiling Sdist                         
- File "src/doc.ml", line 15, characters 8-16:
- Warning 27: unused variable projFile.
- 
- [48 of 57] Compiling Help                          
- [49 of 57] Compiling Path_generated                
- File "src/sdist.ml", line 28, characters 14-178:
- Warning 4: this pattern-matching is fragile.
- It will remain exhaustive when constructors are added to type Obuild.Filetype.t.
- File "src/sdist.ml", line 36, characters 12-154:
- Warning 4: this pattern-matching is fragile.
- It will remain exhaustive when constructors are added to type Obuild.Filetype.t.
- File "src/sdist.ml", line 9, characters 17-27:
- Warning 27: unused variable isSnapshot.
- 
- [50 of 57] Compiling Init                          
- [51 of 57] Linking executable dist/build/obuild-from-oasis/obuild-from-oasis
- File "src/init.ml", line 98, characters 45-62:
- Warning 3: deprecated: String.capitalize
- Use String.capitalize_ascii instead.
- 
- [52 of 57] Linking executable dist/build/obuild-simple/obuild-simple
- [53 of 57] Compiling Main                          
- [54 of 57] Checking dist/build/obuild-from-oasis
- [55 of 57] Checking dist/build/obuild-simple
- [56 of 57] Linking executable dist/build/obuild/obuild
- [57 of 57] Checking dist/build/obuild
- 
- real	0m2.151s
- user	0m1.851s
- sys	0m0.997s
- 4.05.0
- Using compat402.ml
- COMPILING compat
- COMPILING fugue
- COMPILING filepath
- COMPILING filesystem
- BUILDING library obuild_ext.cmxa
- COMPILING types
- COMPILING gconf
- COMPILING filetype
- COMPILING dag
- COMPILING libname
- COMPILING pp
- File "pp.ml", line 13, characters 26-42:
- Warning 3: deprecated: String.lowercase
- Use String.lowercase_ascii instead.
- COMPILING expr
- File "expr.ml", line 129, characters 20-119:
- Warning 8: this pattern-matching is not exhaustive.
- Here is an example of a case that is not matched:
- (_::_::_::_|[])
- File "expr.ml", line 132, characters 23-134:
- Warning 8: this pattern-matching is not exhaustive.
- Here is an example of a case that is not matched:
- (_::_::_::_|[])
- COMPILING utils
- COMPILING modname
- File "modname.ml", line 22, characters 12-26:
- Warning 3: deprecated: Char.uppercase
- Use Char.uppercase_ascii instead.
- File "modname.ml", line 27, characters 15-34:
- Warning 3: deprecated: String.uncapitalize
- Use String.uncapitalize_ascii instead.
- File "modname.ml", line 28, characters 27-46:
- Warning 3: deprecated: String.uncapitalize
- Use String.uncapitalize_ascii instead.
- File "modname.ml", line 47, characters 34-51:
- Warning 3: deprecated: String.capitalize
- Use String.capitalize_ascii instead.
- File "modname.ml", line 49, characters 12-29:
- Warning 3: deprecated: String.capitalize
- Use String.capitalize_ascii instead.
- COMPILING taskdep
- COMPILING helper
- COMPILING dagutils
- COMPILING process
- COMPILING findlibConf
- COMPILING scheduler
- COMPILING prog
- COMPILING dependencies
- COMPILING generators
- COMPILING hier
- File "hier.ml", line 88, characters 15-34:
- Warning 3: deprecated: String.uncapitalize
- Use String.uncapitalize_ascii instead.
- File "hier.ml", line 194, characters 28-45:
- Warning 3: deprecated: String.capitalize
- Use String.capitalize_ascii instead.
- COMPILING meta
- COMPILING metacache
- COMPILING target
- COMPILING dist
- COMPILING project
- File "project.ml", line 84, characters 8-24:
- Warning 3: deprecated: String.lowercase
- Use String.lowercase_ascii instead.
- File "project.ml", line 96, characters 53-70:
- Warning 3: deprecated: String.capitalize
- Use String.capitalize_ascii instead.
- File "project.ml", line 105, characters 10-26:
- Warning 3: deprecated: String.lowercase
- Use String.lowercase_ascii instead.
- File "project.ml", line 207, characters 15-31:
- Warning 3: deprecated: String.lowercase
- Use String.lowercase_ascii instead.
- File "project.ml", line 224, characters 13-29:
- Warning 3: deprecated: String.lowercase
- Use String.lowercase_ascii instead.
- File "project.ml", line 255, characters 17-33:
- Warning 3: deprecated: String.lowercase
- Use String.lowercase_ascii instead.
- File "project.ml", line 267, characters 13-29:
- Warning 3: deprecated: String.lowercase
- Use String.lowercase_ascii instead.
- File "project.ml", line 386, characters 13-29:
- Warning 3: deprecated: String.lowercase
- Use String.lowercase_ascii instead.
- File "project.ml", line 477, characters 15-31:
- Warning 3: deprecated: String.lowercase
- Use String.lowercase_ascii instead.
- File "project.ml", line 488, characters 14-30:
- Warning 3: deprecated: String.lowercase
- Use String.lowercase_ascii instead.
- COMPILING analyze
- File "analyze.ml", line 110, characters 23-39:
- Warning 3: deprecated: String.lowercase
- Use String.lowercase_ascii instead.
- COMPILING configure
- File "configure.ml", line 34, characters 57-73:
- Warning 3: deprecated: String.uppercase
- Use String.uppercase_ascii instead.
- COMPILING prepare
- File "prepare.ml", line 379, characters 10-113:
- Warning 8: this pattern-matching is not exhaustive.
- Here is an example of a case that is not matched:
- DirectoryEntry _
- COMPILING buildprogs
- COMPILING build
- COMPILING exception
- BUILDING library obuild.cmxa
- COMPILING sdist
- COMPILING doc
- COMPILING init
- File "init.ml", line 98, characters 45-62:
- Warning 3: deprecated: String.capitalize
- Use String.capitalize_ascii instead.
- COMPILING help
- COMPILING install
- COMPILING path_generated
- COMPILING main
- LINKING obuild.bootstrap
- Configuring obuild-0.1.9...
- [ 1 of 57] Compiling Ext.Compat                    
- [ 2 of 57] Compiling Ext.Fugue                     
- [ 3 of 57] Intfing Ext.Filepath                  
- [ 4 of 57] Compiling Ext.Filepath                  
- [ 5 of 57] Intfing Ext.Filesystem                
- [ 6 of 57] Compiling Ext.Filesystem                
- File "ext/filesystem.ml", line 18, characters 11-216:
- Warning 4: this pattern-matching is fragile.
- It will remain exhaustive when constructors are added to type Unix.file_kind.
- 
- [ 7 of 57] Packing Ext                           
- [ 8 of 57] Linking library dist/build/lib-obuild.ext/obuild_ext.cmxa
- [ 8 of 57] Linking library dist/build/lib-obuild.ext/obuild_ext.cmxs
- [ 8 of 57] Linking library dist/build/lib-obuild.ext/obuild_ext.cma
- [ 9 of 57] Checking dist/build/lib-obuild.ext
- [10 of 57] Compiling Obuild.Filetype               
- [11 of 57] Compiling Obuild.Gconf                  
- [12 of 57] Compiling Obuild.Pp                     
- [13 of 57] Compiling Obuild.Dag                    
- File "obuild/pp.ml", line 13, characters 26-42:
- Warning 3: deprecated: String.lowercase
- Use String.lowercase_ascii instead.
- 
- [14 of 57] Compiling Obuild.Expr                   
- [15 of 57] Compiling Obuild.Modname                
- File "obuild/expr.ml", line 129, characters 20-119:
- Warning 8: this pattern-matching is not exhaustive.
- Here is an example of a case that is not matched:
- (_::_::_::_|[])
- File "obuild/expr.ml", line 132, characters 23-134:
- Warning 8: this pattern-matching is not exhaustive.
- Here is an example of a case that is not matched:
- (_::_::_::_|[])
- File "obuild/expr.ml", line 216, characters 8-232:
- Warning 4: this pattern-matching is fragile.
- It will remain exhaustive when constructors are added to type Token.t.
- File "obuild/expr.ml", line 209, characters 4-849:
- Warning 4: this pattern-matching is fragile.
- It will remain exhaustive when constructors are added to type Token.t.
- File "obuild/expr.ml", line 233, characters 4-205:
- Warning 4: this pattern-matching is fragile.
- It will remain exhaustive when constructors are added to type Token.t.
- File "obuild/expr.ml", line 268, characters 2-232:
- Warning 4: this pattern-matching is fragile.
- It will remain exhaustive when constructors are added to type Token.t.
- 
- [16 of 57] Compiling Obuild.Types                  
- File "obuild/modname.ml", line 22, characters 12-26:
- Warning 3: deprecated: Char.uppercase
- Use Char.uppercase_ascii instead.
- File "obuild/modname.ml", line 27, characters 15-34:
- Warning 3: deprecated: String.uncapitalize
- Use String.uncapitalize_ascii instead.
- File "obuild/modname.ml", line 28, characters 27-46:
- Warning 3: deprecated: String.uncapitalize
- Use String.uncapitalize_ascii instead.
- File "obuild/modname.ml", line 47, characters 34-51:
- Warning 3: deprecated: String.capitalize
- Use String.capitalize_ascii instead.
- File "obuild/modname.ml", line 49, characters 12-29:
- Warning 3: deprecated: String.capitalize
- Use String.capitalize_ascii instead.
- 
- [17 of 57] Compiling Obuild.Taskdep                
- [18 of 57] Compiling Obuild.Libname                
- [19 of 57] Compiling Obuild.Utils                  
- [20 of 57] Compiling Obuild.Dagutils               
- [21 of 57] Compiling Obuild.Helper                 
- [22 of 57] Compiling Obuild.Process                
- File "obuild/process.ml", line 95, characters 2-193:
- Warning 4: this pattern-matching is fragile.
- It will remain exhaustive when constructors are added to type Unix.process_status.
- 
- [23 of 57] Compiling Obuild.Scheduler              
- [24 of 57] Compiling Obuild.FindlibConf            
- [25 of 57] Compiling Obuild.Prog                   
- [26 of 57] Compiling Obuild.Meta                   
- [27 of 57] Compiling Obuild.Generators             
- File "obuild/generators.ml", line 55, characters 10-101:
- Warning 4: this pattern-matching is fragile.
- It will remain exhaustive when constructors are added to type Filetype.t.
- 
- [28 of 57] Compiling Obuild.Dependencies           
- [29 of 57] Compiling Obuild.Hier                   
- File "obuild/meta.ml", line 129, characters 27-155:
- Warning 4: this pattern-matching is fragile.
- It will remain exhaustive when constructors are added to type Predicate.t.
- File "obuild/meta.ml", line 139, characters 29-147:
- Warning 4: this pattern-matching is fragile.
- It will remain exhaustive when constructors are added to type Predicate.t.
- File "obuild/meta.ml", line 315, characters 28-300:
- Warning 4: this pattern-matching is fragile.
- It will remain exhaustive when constructors are added to type t.
- File "obuild/meta.ml", line 324, characters 48-235:
- Warning 4: this pattern-matching is fragile.
- It will remain exhaustive when constructors are added to type t.
- File "obuild/meta.ml", line 330, characters 48-251:
- Warning 4: this pattern-matching is fragile.
- It will remain exhaustive when constructors are added to type t.
- File "obuild/meta.ml", line 321, characters 40-683:
- Warning 4: this pattern-matching is fragile.
- It will remain exhaustive when constructors are added to type t.
- File "obuild/meta.ml", line 347, characters 8-454:
- Warning 4: this pattern-matching is fragile.
- It will remain exhaustive when constructors are added to type t.
- File "obuild/meta.ml", line 361, characters 8-243:
- Warning 4: this pattern-matching is fragile.
- It will remain exhaustive when constructors are added to type t.
- File "obuild/meta.ml", line 370, characters 8-411:
- Warning 4: this pattern-matching is fragile.
- It will remain exhaustive when constructors are added to type t.
- File "obuild/meta.ml", line 382, characters 8-410:
- Warning 4: this pattern-matching is fragile.
- It will remain exhaustive when constructors are added to type t.
- File "obuild/meta.ml", line 394, characters 8-190:
- Warning 4: this pattern-matching is fragile.
- It will remain exhaustive when constructors are added to type t.
- File "obuild/meta.ml", line 401, characters 8-242:
- Warning 4: this pattern-matching is fragile.
- It will remain exhaustive when constructors are added to type t.
- File "obuild/meta.ml", line 410, characters 26-158:
- Warning 4: this pattern-matching is fragile.
- It will remain exhaustive when constructors are added to type t.
- File "obuild/meta.ml", line 415, characters 8-144:
- Warning 4: this pattern-matching is fragile.
- It will remain exhaustive when constructors are added to type t.
- File "obuild/meta.ml", line 421, characters 8-251:
- Warning 4: this pattern-matching is fragile.
- It will remain exhaustive when constructors are added to type t.
- File "obuild/meta.ml", line 337, characters 31-4646:
- Warning 4: this pattern-matching is fragile.
- It will remain exhaustive when constructors are added to type t.
- File "obuild/meta.ml", line 5, characters 0-11:
- Warning 33: unused open Helper.
- File "obuild/meta.ml", line 6, characters 0-10:
- Warning 33: unused open Gconf.
- 
- [30 of 57] Compiling Obuild.Metacache              
- File "obuild/metacache.ml", line 1, characters 0-9:
- Warning 33: unused open Meta.
- 
- File "obuild/hier.ml", line 88, characters 15-34:
- Warning 3: deprecated: String.uncapitalize
- Use String.uncapitalize_ascii instead.
- File "obuild/hier.ml", line 194, characters 28-45:
- Warning 3: deprecated: String.capitalize
- Use String.capitalize_ascii instead.
- File "obuild/hier.ml", line 3, characters 0-10:
- Warning 33: unused open Types.
- 
- [31 of 57] Compiling Obuild.Target                 
- [32 of 57] Compiling Obuild.Project                
- [33 of 57] Compiling Obuild.Dist                   
- File "obuild/project.ml", line 84, characters 8-24:
- Warning 3: deprecated: String.lowercase
- Use String.lowercase_ascii instead.
- File "obuild/project.ml", line 96, characters 53-70:
- Warning 3: deprecated: String.capitalize
- Use String.capitalize_ascii instead.
- File "obuild/project.ml", line 105, characters 10-26:
- Warning 3: deprecated: String.lowercase
- Use String.lowercase_ascii instead.
- File "obuild/project.ml", line 207, characters 15-31:
- Warning 3: deprecated: String.lowercase
- Use String.lowercase_ascii instead.
- File "obuild/project.ml", line 224, characters 13-29:
- Warning 3: deprecated: String.lowercase
- Use String.lowercase_ascii instead.
- File "obuild/project.ml", line 255, characters 17-33:
- Warning 3: deprecated: String.lowercase
- Use String.lowercase_ascii instead.
- File "obuild/project.ml", line 267, characters 13-29:
- Warning 3: deprecated: String.lowercase
- Use String.lowercase_ascii instead.
- File "obuild/project.ml", line 386, characters 13-29:
- Warning 3: deprecated: String.lowercase
- Use String.lowercase_ascii instead.
- File "obuild/project.ml", line 477, characters 15-31:
- Warning 3: deprecated: String.lowercase
- Use String.lowercase_ascii instead.
- File "obuild/project.ml", line 488, characters 14-30:
- Warning 3: deprecated: String.lowercase
- Use String.lowercase_ascii instead.
- 
- [34 of 57] Compiling Obuild.Analyze                
- File "obuild/analyze.ml", line 59, characters 8-94:
- Warning 4: this pattern-matching is fragile.
- It will remain exhaustive when constructors are added to type Target.Name.t.
- File "obuild/analyze.ml", line 110, characters 23-39:
- Warning 3: deprecated: String.lowercase
- Use String.lowercase_ascii instead.
- File "obuild/analyze.ml", line 184, characters 22-466:
- Warning 4: this pattern-matching is fragile.
- It will remain exhaustive when constructors are added to type Meta.Predicate.t.
- File "obuild/analyze.ml", line 208, characters 10-182:
- Warning 4: this pattern-matching is fragile.
- It will remain exhaustive when constructors are added to type Target.Name.t.
- 
- [35 of 57] Compiling Obuild.Configure              
- [36 of 57] Compiling Obuild.Prepare                
- File "obuild/configure.ml", line 34, characters 57-73:
- Warning 3: deprecated: String.uppercase
- Use String.uppercase_ascii instead.
- 
- File "obuild/prepare.ml", line 168, characters 8-93:
- Warning 4: this pattern-matching is fragile.
- It will remain exhaustive when constructors are added to type Analyze.dependency_tag.
- File "obuild/prepare.ml", line 218, characters 17-557:
- Warning 4: this pattern-matching is fragile.
- It will remain exhaustive when constructors are added to type Filetype.t.
- File "obuild/prepare.ml", line 379, characters 10-113:
- Warning 8: this pattern-matching is not exhaustive.
- Here is an example of a case that is not matched:
- DirectoryEntry _
- File "obuild/prepare.ml", line 489, characters 10-224:
- Warning 4: this pattern-matching is fragile.
- It will remain exhaustive when constructors are added to type compile_step.
- File "obuild/prepare.ml", line 552, characters 6-99:
- Warning 4: this pattern-matching is fragile.
- It will remain exhaustive when constructors are added to type Analyze.dep_type.
- File "obuild/prepare.ml", line 202, characters 9-16:
- Warning 27: unused variable srcPath.
- File "obuild/prepare.ml", line 233, characters 13-20:
- Warning 27: unused variable srcPath.
- File "obuild/prepare.ml", line 239, characters 37-41:
- Warning 27: unused variable path.
- 
- [37 of 57] Compiling Obuild.Buildprogs             
- File "obuild/buildprogs.ml", line 69, characters 14-206:
- Warning 4: this pattern-matching is fragile.
- It will remain exhaustive when constructors are added to type Filetype.t.
- File "obuild/buildprogs.ml", line 66, characters 17-23:
- Warning 27: unused variable srcDir.
- 
- [38 of 57] Compiling Obuild.Build                  
- File "obuild/build.ml", line 60, characters 45-688:
- Warning 4: this pattern-matching is fragile.
- It will remain exhaustive when constructors are added to type Filetype.t.
- File "obuild/build.ml", line 59, characters 4-1138:
- Warning 4: this pattern-matching is fragile.
- It will remain exhaustive when constructors are added to type Filetype.t.
- File "obuild/build.ml", line 89, characters 6-63:
- Warning 4: this pattern-matching is fragile.
- It will remain exhaustive when constructors are added to type Types.ocaml_compiled_type.
- File "obuild/build.ml", line 89, characters 6-63:
- Warning 4: this pattern-matching is fragile.
- It will remain exhaustive when constructors are added to type Types.ocaml_compilation_option.
- File "obuild/build.ml", line 150, characters 20-196:
- Warning 4: this pattern-matching is fragile.
- It will remain exhaustive when constructors are added to type Hier.file_entry.
- File "obuild/build.ml", line 349, characters 22-124:
- Warning 4: this pattern-matching is fragile.
- It will remain exhaustive when constructors are added to type Types.ocaml_compilation_option.
- File "obuild/build.ml", line 360, characters 13-458:
- Warning 4: this pattern-matching is fragile.
- It will remain exhaustive when constructors are added to type Target.Name.t.
- File "obuild/build.ml", line 481, characters 40-160:
- Warning 4: this pattern-matching is fragile.
- It will remain exhaustive when constructors are added to type Prepare.compile_step.
- 
- [39 of 57] Compiling Obuild.Exception              
- [40 of 57] Packing Obuild                        
- [41 of 57] Linking library dist/build/lib-obuild/obuild.cmxa
- [41 of 57] Linking library dist/build/lib-obuild/obuild.cmxs
- [41 of 57] Linking library dist/build/lib-obuild/obuild.cma
- [42 of 57] Checking dist/build/lib-obuild
- [43 of 57] Compiling Assimilate_oasis              
- [44 of 57] Compiling Simple                        
- [45 of 57] Compiling Install                       
- [46 of 57] Compiling Doc                           
- File "src/install.ml", line 21, characters 6-264:
- Warning 4: this pattern-matching is fragile.
- It will remain exhaustive when constructors are added to type Obuild.Filetype.t.
- File "src/install.ml", line 27, characters 4-116:
- Warning 4: this pattern-matching is fragile.
- It will remain exhaustive when constructors are added to type Obuild.Filetype.t.
- File "src/install.ml", line 43, characters 31-137:
- Warning 4: this pattern-matching is fragile.
- It will remain exhaustive when constructors are added to type Obuild.Target.Name.t.
- File "src/install.ml", line 47, characters 31-137:
- Warning 4: this pattern-matching is fragile.
- It will remain exhaustive when constructors are added to type Obuild.Target.Name.t.
- 
- [47 of 57] Compiling Sdist                         
- File "src/doc.ml", line 15, characters 8-16:
- Warning 27: unused variable projFile.
- 
- [48 of 57] Compiling Help                          
- [49 of 57] Compiling Path_generated                
- File "src/sdist.ml", line 28, characters 14-178:
- Warning 4: this pattern-matching is fragile.
- It will remain exhaustive when constructors are added to type Obuild.Filetype.t.
- File "src/sdist.ml", line 36, characters 12-154:
- Warning 4: this pattern-matching is fragile.
- It will remain exhaustive when constructors are added to type Obuild.Filetype.t.
- File "src/sdist.ml", line 9, characters 17-27:
- Warning 27: unused variable isSnapshot.
- 
- [50 of 57] Compiling Init                          
- [51 of 57] Linking executable dist/build/obuild-from-oasis/obuild-from-oasis
- File "src/init.ml", line 98, characters 45-62:
- Warning 3: deprecated: String.capitalize
- Use String.capitalize_ascii instead.
- 
- [52 of 57] Linking executable dist/build/obuild-simple/obuild-simple
- [53 of 57] Compiling Main                          
- [54 of 57] Checking dist/build/obuild-from-oasis
- [55 of 57] Checking dist/build/obuild-simple
- [56 of 57] Linking executable dist/build/obuild/obuild
- [57 of 57] Checking dist/build/obuild
- 
- real	0m2.151s
- user	0m1.851s
- sys	0m0.997s
-> compiled  obuild.0.1.10
Processing  8/14: [ounit2: dune build]
-> installed obuild.0.1.10
Processing  9/14: [ounit2: dune build]
+ /home/opam/.opam/4.05/bin/dune "build" "-p" "ounit2" "-j" "31" (CWD=/home/opam/.opam/4.05/.opam-switch/build/ounit2.2.2.6)
-> compiled  ounit2.2.2.6
-> installed ounit2.2.2.6
Processing 12/14: [ounit: make install-ounit]
+ /usr/bin/make "install-ounit" "version=2.2.6" (CWD=/home/opam/.opam/4.05/.opam-switch/build/ounit.2.2.6)
- ocamlfind remove oUnit
- ocamlfind: [WARNING] No such file: /home/opam/.opam/4.05/lib/oUnit/META
- ocamlfind install oUnit src/lib/oUnit/META -patch-version 2.2.6
- Installed /home/opam/.opam/4.05/lib/oUnit/META
-> installed ounit.2.2.6
Processing 13/14: [irc-client: patch]
Processing 13/14: [irc-client: make]
+ /usr/bin/make  (CWD=/home/opam/.opam/4.05/.opam-switch/build/irc-client.0.1.1)
- obuild configure --enable-tests 
- Configuring irc-client-0.1.1...
- obuild build
- [ 1 of 13] Compiling Irc_helpers                   
- [ 2 of 13] Compiling Irc_transport                 
- [ 3 of 13] Compiling Irc_message                   
- [ 4 of 13] Intfing Irc_client                    
- [ 5 of 13] Compiling Irc_client                    
- File "lib/irc_client.ml", line 53, characters 20-33:
- Warning 3: deprecated: String.create
- Use Bytes.create instead.
- 
- [ 6 of 13] Linking library dist/build/lib-irc_client/irc_client.cmxa
- [ 6 of 13] Linking library dist/build/lib-irc_client/irc_client.cmxs
- [ 6 of 13] Linking library dist/build/lib-irc_client/irc_client.cma
- [ 7 of 13] Checking dist/build/lib-irc_client
- [ 8 of 13] Compiling Irc_client_unix               
- [ 9 of 13] Compiling Test_parser                   
- [10 of 13] Linking library dist/build/lib-irc_client.unix/irc_client_unix.cmxa
- [10 of 13] Linking library dist/build/lib-irc_client.unix/irc_client_unix.cmxs
- [10 of 13] Linking library dist/build/lib-irc_client.unix/irc_client_unix.cma
- [11 of 13] Linking executable dist/build/test_parser/test-test_parser
- 
- File "_none_", line 1:
- Error: Cannot find file oUnitAdvanced.cmxa
- 
- make: *** [Makefile:10: dist/build/lib-irc-client/irc-client.cmxa] Error 6
[ERROR] The compilation of irc-client failed at "/usr/bin/make".

#=== ERROR while compiling irc-client.0.1.1 ===================================#
# context              2.0.10 | linux/x86_64 | ocaml-base-compiler.4.05.0 | file:///src
# path                 ~/.opam/4.05/.opam-switch/build/irc-client.0.1.1
# command              /usr/bin/make
# exit-code            2
# env-file             ~/.opam/log/irc-client-262-322141.env
# output-file          ~/.opam/log/irc-client-262-322141.out
### output ###
# obuild configure --enable-tests 
# Configuring irc-client-0.1.1...
# obuild build
# [ 1 of 13] Compiling Irc_helpers                   
# [ 2 of 13] Compiling Irc_transport                 
# [ 3 of 13] Compiling Irc_message                   
# [ 4 of 13] Intfing Irc_client                    
# [ 5 of 13] Compiling Irc_client                    
# File "lib/irc_client.ml", line 53, characters 20-33:
# Warning 3: deprecated: String.create
# Use Bytes.create instead.
# 
# [ 6 of 13] Linking library dist/build/lib-irc_client/irc_client.cmxa
# [ 6 of 13] Linking library dist/build/lib-irc_client/irc_client.cmxs
# [ 6 of 13] Linking library dist/build/lib-irc_client/irc_client.cma
# [ 7 of 13] Checking dist/build/lib-irc_client
# [ 8 of 13] Compiling Irc_client_unix               
# [ 9 of 13] Compiling Test_parser                   
# [10 of 13] Linking library dist/build/lib-irc_client.unix/irc_client_unix.cmxa
# [10 of 13] Linking library dist/build/lib-irc_client.unix/irc_client_unix.cmxs
# [10 of 13] Linking library dist/build/lib-irc_client.unix/irc_client_unix.cma
# [11 of 13] Linking executable dist/build/test_parser/test-test_parser
# 
# File "_none_", line 1:
# Error: Cannot find file oUnitAdvanced.cmxa
# 
# make: *** [Makefile:10: dist/build/lib-irc-client/irc-client.cmxa] Error 6



<><> Error report <><><><><><><><><><><><><><><><><><><><><><><><><><><><><><><>
+- The following actions failed
| - build irc-client 0.1.1
+- 
+- The following changes have been performed
| - install base-bytes   base
| - install obuild       0.1.10
| - install ounit        2.2.6
| - install ounit2       2.2.6
| - install seq          0.2.2
| - install stdlib-shims 0.3.0
+- 
# Run eval $(opam env) to update the current shell environment

The former state can be restored with:
    opam switch import "/home/opam/.opam/4.05/.opam-switch/backup/state-20220825153724.export"
'opam install --verbose --yes irc-client.0.1.1 base-bytes.base dune.1.11.4 obuild.0.1.10 ocamlfind.1.9.5 ounit.2.2.6 ounit2.2.2.6 seq.0.2.2 stdlib-shims.0.3.0' failed.