package protocol-9p

  1. Overview
  2. Docs
On This Page
  1. Error log

protocol-9p 0.11.3

Error log

The package failed to build. The error log from opam follows.

Opam plugin "depext" may require upgrading/reinstalling. Reinstall the plugin on the current switch? [Y/n] y
The following actions will be performed:
  - recompile opam-depext 1.2.1-1

<><> Processing actions <><><><><><><><><><><><><><><><><><><><><><><><><><><><>
-> retrieved opam-depext.1.2.1-1  (cached)
-> removed   opam-depext.1.2.1-1
-> installed opam-depext.1.2.1-1
Done.

<><> opam-depext.1.2.1-1 installed successfully <><><><><><><><><><><><><><><><>
=> opam-depext is unnecessary when used with opam >= 2.1. Please use opam install directly instead
# Run eval $(opam env) to update the current shell environment

<><> Carrying on to "opam depext -viy protocol-9p-unix.0.11.3 win-error.1.0 topkg.1.0.7 stdlib-shims.0.3.0 sexplib0.v0.13.0 sexplib.v0.13.0 seq.base rresult.0.7.0 result.1.5 re.1.9.0 protocol-9p.0.11.3 prometheus.1.1 ppxlib.0.15.0 ppx_tools.6.6 ppx_sexp_conv.v0.13.0 ppx_deriving.5.1 ppx_derivers.1.2.1 parsexp.v0.13.0 ocplib-endian.1.2 ocb-stubblr.0.1.1-1 ocamlfind.1.9.6 ocamlbuild.0.14.3 ocaml-migrate-parsetree.1.8.0 ocaml-compiler-libs.v0.12.3 num.1.5 named-pipe.0.4.0 mmap.1.2.0 mirage-kv-lwt.1.1.0 mirage-kv.1.1.1 mirage-flow-lwt.1.6.0 mirage-flow.1.6.0 mirage-device.1.2.0 mirage-clock.2.0.0 mirage-channel-lwt.3.2.0 mirage-channel.3.2.0 lwt.4.5.0 logs.0.7.0 jbuilder.transition io-page-unix.2.3.0 io-page.2.3.0 fmt.0.9.0 dune-configurator.1.0.0 dune.1.11.4 cstruct-lwt.3.7.0 cstruct.3.7.0 cppo.1.6.9 cmdliner.1.2.0 bigarray-compat.1.1.0 base-bytes.base base.v0.13.2 astring.0.8.5 asetmap.0.8.1" 

You are using opam 2.1+, where external dependency handling has been integrated: consider calling opam directly, the 'depext' plugin interface is provided for backwards compatibility only
# Detecting depexts using vars: arch=x86_64, os=linux, os-distribution=debian, os-family=debian
# No extra OS packages requirements found.
[NOTE] Package dune is already installed (current version is 1.11.4).
[NOTE] Package ocamlfind is already installed (current version is 1.9.6).
The following actions will be performed:
  - install cppo                    1.6.9
  - install dune-configurator       1.0.0
  - install ppx_derivers            1.2.1
  - install ocamlbuild              0.14.3
  - install num                     1.5
  - install cmdliner                1.2.0
  - install sexplib0                v0.13.0
  - install ocaml-compiler-libs     v0.12.3
  - install bigarray-compat         1.1.0
  - install seq                     base
  - install base-bytes              base
  - install stdlib-shims            0.3.0
  - install jbuilder                transition
  - install result                  1.5
  - install ppx_tools               6.6
  - install topkg                   1.0.7
  - install base                    v0.13.2
  - install mmap                    1.2.0
  - install re                      1.9.0
  - install win-error               1.0
  - install ocplib-endian           1.2
  - install ocaml-migrate-parsetree 1.8.0
  - install rresult                 0.7.0
  - install fmt                     0.9.0
  - install astring                 0.8.5
  - install asetmap                 0.8.1
  - install parsexp                 v0.13.0
  - install lwt                     4.5.0
  - install ppxlib                  0.15.0
  - install mirage-flow             1.6.0
  - install mirage-device           1.2.0
  - install ocb-stubblr             0.1.1-1
  - install sexplib                 v0.13.0
  - install prometheus              1.1
  - install logs                    0.7.0
  - install ppx_sexp_conv           v0.13.0
  - install ppx_deriving            5.1
  - install mirage-channel          3.2.0
  - install mirage-kv               1.1.1
  - install mirage-clock            2.0.0
  - install named-pipe              0.4.0
  - install cstruct                 3.7.0
  - install mirage-kv-lwt           1.1.0
  - install mirage-flow-lwt         1.6.0
  - install io-page                 2.3.0
  - install cstruct-lwt             3.7.0
  - install mirage-channel-lwt      3.2.0
  - install io-page-unix            2.3.0
  - install protocol-9p             0.11.3
  - install protocol-9p-unix        0.11.3
===== 50 to install =====

<><> Processing actions <><><><><><><><><><><><><><><><><><><><><><><><><><><><>
Processing  1/150:
Processing  2/150:
Processing  3/150:
-> retrieved asetmap.0.8.1  (cached)
Processing  4/150:
Processing  5/150:
Processing  6/150:
-> installed base-bytes.base
Processing  7/150:
-> retrieved astring.0.8.5  (cached)
Processing  8/150:
-> retrieved base.v0.13.2  (cached)
Processing  9/150:
-> retrieved bigarray-compat.1.1.0  (cached)
Processing 10/150:
Processing 11/150: [bigarray-compat: dune build]
-> retrieved cmdliner.1.2.0  (cached)
Processing 12/150: [bigarray-compat: dune build]
Processing 13/150: [bigarray-compat: dune build] [cmdliner: make all]
-> retrieved cppo.1.6.9  (cached)
Processing 14/150: [bigarray-compat: dune build] [cmdliner: make all]
Processing 15/150: [bigarray-compat: dune build] [cmdliner: make all]
Processing 16/150: [bigarray-compat: dune build] [cmdliner: make all] [cppo: dune build]
Processing 17/150: [bigarray-compat: dune build] [cmdliner: make all] [cppo: dune build]
-> installed dune-configurator.1.0.0
Processing 18/150: [bigarray-compat: dune build] [cmdliner: make all] [cppo: dune build]
-> retrieved cstruct.3.7.0  (cached)
Processing 19/150: [bigarray-compat: dune build] [cmdliner: make all] [cppo: dune build]
-> retrieved cstruct-lwt.3.7.0  (cached)
Processing 20/150: [bigarray-compat: dune build] [cmdliner: make all] [cppo: dune build]
-> retrieved fmt.0.9.0  (cached)
Processing 21/150: [bigarray-compat: dune build] [cmdliner: make all] [cppo: dune build]
Processing 22/150: [bigarray-compat: dune build] [cmdliner: make all] [cppo: dune build]
Processing 23/150: [bigarray-compat: dune build] [cmdliner: make all] [cppo: dune build]
-> installed jbuilder.transition
Processing 24/150: [bigarray-compat: dune build] [cmdliner: make all] [cppo: dune build]
-> retrieved io-page.2.3.0  (cached)
Processing 25/150: [bigarray-compat: dune build] [cmdliner: make all] [cppo: dune build]
-> retrieved io-page-unix.2.3.0  (cached)
Processing 26/150: [bigarray-compat: dune build] [cmdliner: make all] [cppo: dune build]
-> retrieved logs.0.7.0  (cached)
Processing 27/150: [bigarray-compat: dune build] [cmdliner: make all] [cppo: dune build]
-> retrieved lwt.4.5.0  (cached)
Processing 28/150: [bigarray-compat: dune build] [cmdliner: make all] [cppo: dune build]
-> retrieved mirage-channel.3.2.0  (cached)
Processing 29/150: [bigarray-compat: dune build] [cmdliner: make all] [cppo: dune build]
-> retrieved mirage-channel-lwt.3.2.0  (cached)
Processing 30/150: [bigarray-compat: dune build] [cmdliner: make all] [cppo: dune build]
-> retrieved mirage-clock.2.0.0  (cached)
Processing 31/150: [bigarray-compat: dune build] [cmdliner: make all] [cppo: dune build]
-> retrieved mirage-device.1.2.0  (cached)
Processing 32/150: [bigarray-compat: dune build] [cmdliner: make all] [cppo: dune build]
-> retrieved mirage-flow.1.6.0  (cached)
Processing 33/150: [bigarray-compat: dune build] [cmdliner: make all] [cppo: dune build]
-> retrieved mirage-flow-lwt.1.6.0  (cached)
Processing 34/150: [bigarray-compat: dune build] [cmdliner: make all] [cppo: dune build]
-> retrieved mirage-kv.1.1.1  (cached)
Processing 35/150: [bigarray-compat: dune build] [cmdliner: make all] [cppo: dune build]
-> retrieved mirage-kv-lwt.1.1.0  (cached)
Processing 36/150: [bigarray-compat: dune build] [cmdliner: make all] [cppo: dune build]
-> retrieved mmap.1.2.0  (cached)
Processing 37/150: [bigarray-compat: dune build] [cmdliner: make all] [cppo: dune build]
-> retrieved named-pipe.0.4.0  (cached)
Processing 38/150: [bigarray-compat: dune build] [cmdliner: make all] [cppo: dune build]
-> retrieved num.1.5  (cached)
Processing 39/150: [bigarray-compat: dune build] [cmdliner: make all] [cppo: dune build]
Processing 40/150: [bigarray-compat: dune build] [cmdliner: make all] [cppo: dune build] [num: make opam-legacy]
-> retrieved ocaml-compiler-libs.v0.12.3  (cached)
Processing 41/150: [bigarray-compat: dune build] [cmdliner: make all] [cppo: dune build] [num: make opam-legacy]
Processing 42/150: [bigarray-compat: dune build] [cmdliner: make all] [cppo: dune build] [num: make opam-legacy] [ocaml-compiler-libs: dune build]
-> retrieved ocamlbuild.0.14.3  (cached)
Processing 43/150: [bigarray-compat: dune build] [cmdliner: make all] [cppo: dune build] [num: make opam-legacy] [ocaml-compiler-libs: dune build]
Processing 44/150: [bigarray-compat: dune build] [cmdliner: make all] [cppo: dune build] [num: make opam-legacy] [ocaml-compiler-libs: dune build] [ocamlbuild: make configure.make]
-> compiled  bigarray-compat.1.1.0
Processing 44/150: [cmdliner: make all] [cppo: dune build] [num: make opam-legacy] [ocaml-compiler-libs: dune build] [ocamlbuild: make configure.make]
-> installed bigarray-compat.1.1.0
Processing 45/150: [cmdliner: make all] [cppo: dune build] [num: make opam-legacy] [ocaml-compiler-libs: dune build] [ocamlbuild: make configure.make]
Processing 46/150: [cmdliner: make all] [cppo: dune build] [mmap: dune build] [num: make opam-legacy] [ocaml-compiler-libs: dune build] [ocamlbuild: make configure.make]
-> retrieved ocaml-migrate-parsetree.1.8.0  (cached)
Processing 47/150: [cmdliner: make all] [cppo: dune build] [mmap: dune build] [num: make opam-legacy] [ocaml-compiler-libs: dune build] [ocamlbuild: make configure.make]
-> retrieved ocb-stubblr.0.1.1-1  (cached)
Processing 48/150: [cmdliner: make all] [cppo: dune build] [mmap: dune build] [num: make opam-legacy] [ocaml-compiler-libs: dune build] [ocamlbuild: make configure.make]
-> retrieved ocplib-endian.1.2  (cached)
Processing 49/150: [cmdliner: make all] [cppo: dune build] [mmap: dune build] [num: make opam-legacy] [ocaml-compiler-libs: dune build] [ocamlbuild: make configure.make]
- (echo "# This file was generated from configure.make"; \
- echo ;\
- echo "OCAML_PREFIX="; \
- echo "OCAML_BINDIR=/home/opam/.opam/4.11/bin"; \
- echo "OCAML_LIBDIR=/home/opam/.opam/4.11/lib/ocaml"; \
- echo "OCAML_MANDIR=/home/opam/.opam/4.11/man"; \
- echo ;\
- echo "EXT_OBJ=.o"; \
- echo "EXT_ASM=.s"; \
- echo "EXT_LIB=.a"; \
- echo "EXT_DLL=.so"; \
- echo "EXE="; \
- echo ;\
- echo "OCAML_NATIVE=true"; \
- echo "OCAML_NATIVE_TOOLS=true"; \
- echo "NATDYNLINK=true"; \
- echo "SUPPORT_SHARED_LIBRARIES=true"; \
- echo ;\
- echo "PREFIX=/home/opam/.opam/4.11"; \
- echo "BINDIR=/home/opam/.opam/4.11/bin"; \
- echo "LIBDIR=/home/opam/.opam/4.11/lib"; \
- echo "MANDIR=/home/opam/.opam/4.11/man"; \
- ) > Makefile.config
- (echo "(* This file was generated from ../configure.make *)"; \
- echo ;\
- echo 'let bindir = "/home/opam/.opam/4.11/bin"'; \
- echo 'let libdir = "/home/opam/.opam/4.11/lib"'; \
- echo 'let ocaml_libdir = "/home/opam/.opam/4.11/lib/ocaml"'; \
- echo 'let libdir_abs = "/home/opam/.opam/4.11/lib"'; \
- echo 'let ocaml_native = true'; \
- echo 'let ocaml_native_tools = true'; \
- echo 'let supports_shared_libraries = true';\
- echo 'let a = "a"'; \
- echo 'let o = "o"'; \
- echo 'let so = "so"'; \
- echo 'let ext_dll = ".so"'; \
- echo 'let exe = ""'; \
- echo 'let version = "0.14.3"'; \
- ) > src/ocamlbuild_config.ml
Processing 49/150: [cmdliner: make all] [cppo: dune build] [mmap: dune build] [num: make opam-legacy] [ocaml-compiler-libs: dune build] [ocamlbuild: make check-if-preinstalled]
-> retrieved parsexp.v0.13.0  (cached)
Processing 50/150: [cmdliner: make all] [cppo: dune build] [mmap: dune build] [num: make opam-legacy] [ocaml-compiler-libs: dune build] [ocamlbuild: make check-if-preinstalled]
-> retrieved ppx_derivers.1.2.1  (cached)
Processing 51/150: [cmdliner: make all] [cppo: dune build] [mmap: dune build] [num: make opam-legacy] [ocaml-compiler-libs: dune build] [ocamlbuild: make check-if-preinstalled]
Processing 52/150: [cmdliner: make all] [cppo: dune build] [mmap: dune build] [num: make opam-legacy] [ocaml-compiler-libs: dune build] [ocamlbuild: make check-if-preinstalled] [ppx_derivers: dune build]
-> retrieved ppx_deriving.5.1  (cached)
Processing 53/150: [cmdliner: make all] [cppo: dune build] [mmap: dune build] [num: make opam-legacy] [ocaml-compiler-libs: dune build] [ocamlbuild: make check-if-preinstalled] [ppx_derivers: dune build]
-> retrieved ppx_sexp_conv.v0.13.0  (cached)
Processing 54/150: [cmdliner: make all] [cppo: dune build] [mmap: dune build] [num: make opam-legacy] [ocaml-compiler-libs: dune build] [ocamlbuild: make check-if-preinstalled] [ppx_derivers: dune build]
-> retrieved ppx_tools.6.6  (cached)
Processing 55/150: [cmdliner: make all] [cppo: dune build] [mmap: dune build] [num: make opam-legacy] [ocaml-compiler-libs: dune build] [ocamlbuild: make check-if-preinstalled] [ppx_derivers: dune build]
-> retrieved prometheus.1.1  (cached)
Processing 56/150: [cmdliner: make all] [cppo: dune build] [mmap: dune build] [num: make opam-legacy] [ocaml-compiler-libs: dune build] [ocamlbuild: make check-if-preinstalled] [ppx_derivers: dune build]
-> retrieved ppxlib.0.15.0  (cached)
Processing 57/150: [cmdliner: make all] [cppo: dune build] [mmap: dune build] [num: make opam-legacy] [ocaml-compiler-libs: dune build] [ocamlbuild: make check-if-preinstalled] [ppx_derivers: dune build]
-> retrieved protocol-9p.0.11.3  (cached)
Processing 58/150: [cmdliner: make all] [cppo: dune build] [mmap: dune build] [num: make opam-legacy] [ocaml-compiler-libs: dune build] [ocamlbuild: make check-if-preinstalled] [ppx_derivers: dune build]
-> retrieved protocol-9p-unix.0.11.3  (cached)
Processing 59/150: [cmdliner: make all] [cppo: dune build] [mmap: dune build] [num: make opam-legacy] [ocaml-compiler-libs: dune build] [ocamlbuild: make check-if-preinstalled] [ppx_derivers: dune build]
-> retrieved re.1.9.0  (cached)
Processing 60/150: [cmdliner: make all] [cppo: dune build] [mmap: dune build] [num: make opam-legacy] [ocaml-compiler-libs: dune build] [ocamlbuild: make check-if-preinstalled] [ppx_derivers: dune build]
Processing 61/150: [cmdliner: make all] [cppo: dune build] [mmap: dune build] [num: make opam-legacy] [ocaml-compiler-libs: dune build] [ocamlbuild: make check-if-preinstalled] [ppx_derivers: dune build]
Processing 62/150: [cmdliner: make all] [cppo: dune build] [mmap: dune build] [num: make opam-legacy] [ocaml-compiler-libs: dune build] [ocamlbuild: make check-if-preinstalled] [ppx_derivers: dune build]
-> installed seq.base
Processing 63/150: [cmdliner: make all] [cppo: dune build] [mmap: dune build] [num: make opam-legacy] [ocaml-compiler-libs: dune build] [ocamlbuild: make check-if-preinstalled] [ppx_derivers: dune build]
Processing 64/150: [cmdliner: make all] [cppo: dune build] [mmap: dune build] [num: make opam-legacy] [ocaml-compiler-libs: dune build] [ocamlbuild: make check-if-preinstalled] [ppx_derivers: dune build] [re: dune build]
-> retrieved result.1.5  (cached)
Processing 65/150: [cmdliner: make all] [cppo: dune build] [mmap: dune build] [num: make opam-legacy] [ocaml-compiler-libs: dune build] [ocamlbuild: make check-if-preinstalled] [ppx_derivers: dune build] [re: dune build]
Processing 66/150: [cmdliner: make all] [cppo: dune build] [mmap: dune build] [num: make opam-legacy] [ocaml-compiler-libs: dune build] [ocamlbuild: make check-if-preinstalled] [ppx_derivers: dune build] [re: dune build] [result: dune build]
-> retrieved rresult.0.7.0  (cached)
Processing 67/150: [cmdliner: make all] [cppo: dune build] [mmap: dune build] [num: make opam-legacy] [ocaml-compiler-libs: dune build] [ocamlbuild: make check-if-preinstalled] [ppx_derivers: dune build] [re: dune build] [result: dune build]
-> retrieved sexplib.v0.13.0  (cached)
Processing 68/150: [cmdliner: make all] [cppo: dune build] [mmap: dune build] [num: make opam-legacy] [ocaml-compiler-libs: dune build] [ocamlbuild: make check-if-preinstalled] [ppx_derivers: dune build] [re: dune build] [result: dune build]
-> retrieved sexplib0.v0.13.0  (cached)
Processing 69/150: [cmdliner: make all] [cppo: dune build] [mmap: dune build] [num: make opam-legacy] [ocaml-compiler-libs: dune build] [ocamlbuild: make check-if-preinstalled] [ppx_derivers: dune build] [re: dune build] [result: dune build]
Processing 70/150: [cmdliner: make all] [cppo: dune build] [mmap: dune build] [num: make opam-legacy] [ocaml-compiler-libs: dune build] [ocamlbuild: make check-if-preinstalled] [ppx_derivers: dune build] [re: dune build] [result: dune build] [sexplib0: dune build]
-> retrieved stdlib-shims.0.3.0  (cached)
Processing 71/150: [cmdliner: make all] [cppo: dune build] [mmap: dune build] [num: make opam-legacy] [ocaml-compiler-libs: dune build] [ocamlbuild: make check-if-preinstalled] [ppx_derivers: dune build] [re: dune build] [result: dune build] [sexplib0: dune build] [stdlib-shims: dune build]
-> retrieved topkg.1.0.7  (cached)
-> retrieved win-error.1.0  (cached)
Processing 72/150: [cmdliner: make all] [cppo: dune build] [mmap: dune build] [num: make opam-legacy] [ocaml-compiler-libs: dune build] [ocamlbuild: make check-if-preinstalled] [ppx_derivers: dune build] [re: dune build] [result: dune build] [sexplib0: dune build] [stdlib-shims: dune build] [win-error: dune build]
-> compiled  mmap.1.2.0
Processing 72/150: [cmdliner: make all] [cppo: dune build] [num: make opam-legacy] [ocaml-compiler-libs: dune build] [ocamlbuild: make check-if-preinstalled] [ppx_derivers: dune build] [re: dune build] [result: dune build] [sexplib0: dune build] [stdlib-shims: dune build] [win-error: dune build]
-> installed mmap.1.2.0
Processing 73/150: [cmdliner: make all] [cppo: dune build] [num: make opam-legacy] [ocaml-compiler-libs: dune build] [ocamlbuild: make check-if-preinstalled] [ppx_derivers: dune build] [re: dune build] [result: dune build] [sexplib0: dune build] [stdlib-shims: dune build] [win-error: dune build]
-> compiled  ppx_derivers.1.2.1
Processing 73/150: [cmdliner: make all] [cppo: dune build] [num: make opam-legacy] [ocaml-compiler-libs: dune build] [ocamlbuild: make check-if-preinstalled] [re: dune build] [result: dune build] [sexplib0: dune build] [stdlib-shims: dune build] [win-error: dune build]
-> installed ppx_derivers.1.2.1
Processing 74/150: [cmdliner: make all] [cppo: dune build] [num: make opam-legacy] [ocaml-compiler-libs: dune build] [ocamlbuild: make check-if-preinstalled] [re: dune build] [result: dune build] [sexplib0: dune build] [stdlib-shims: dune build] [win-error: dune build]
-> compiled  stdlib-shims.0.3.0
Processing 74/150: [cmdliner: make all] [cppo: dune build] [num: make opam-legacy] [ocaml-compiler-libs: dune build] [ocamlbuild: make check-if-preinstalled] [re: dune build] [result: dune build] [sexplib0: dune build] [win-error: dune build]
-> installed stdlib-shims.0.3.0
Processing 75/150: [cmdliner: make all] [cppo: dune build] [num: make opam-legacy] [ocaml-compiler-libs: dune build] [ocamlbuild: make check-if-preinstalled] [re: dune build] [result: dune build] [sexplib0: dune build] [win-error: dune build]
-> compiled  result.1.5
Processing 75/150: [cmdliner: make all] [cppo: dune build] [num: make opam-legacy] [ocaml-compiler-libs: dune build] [ocamlbuild: make check-if-preinstalled] [re: dune build] [sexplib0: dune build] [win-error: dune build]
-> installed result.1.5
Processing 76/150: [cmdliner: make all] [cppo: dune build] [num: make opam-legacy] [ocaml-compiler-libs: dune build] [ocamlbuild: make check-if-preinstalled] [re: dune build] [sexplib0: dune build] [win-error: dune build]
Processing 77/150: [cmdliner: make all] [cppo: dune build] [num: make opam-legacy] [ocaml-compiler-libs: dune build] [ocaml-migrate-parsetree: dune build] [ocamlbuild: make check-if-preinstalled] [re: dune build] [sexplib0: dune build] [win-error: dune build]
-> compiled  cppo.1.6.9
Processing 77/150: [cmdliner: make all] [num: make opam-legacy] [ocaml-compiler-libs: dune build] [ocaml-migrate-parsetree: dune build] [ocamlbuild: make check-if-preinstalled] [re: dune build] [sexplib0: dune build] [win-error: dune build]
-> installed cppo.1.6.9
Processing 78/150: [cmdliner: make all] [num: make opam-legacy] [ocaml-compiler-libs: dune build] [ocaml-migrate-parsetree: dune build] [ocamlbuild: make check-if-preinstalled] [re: dune build] [sexplib0: dune build] [win-error: dune build]
Processing 79/150: [cmdliner: make all] [num: make opam-legacy] [ocaml-compiler-libs: dune build] [ocaml-migrate-parsetree: dune build] [ocamlbuild: make check-if-preinstalled] [ocplib-endian: dune build] [re: dune build] [sexplib0: dune build] [win-error: dune build]
Processing 80/150: [cmdliner: make all] [num: make opam-legacy] [ocaml-compiler-libs: dune build] [ocaml-migrate-parsetree: dune build] [ocamlbuild: make check-if-preinstalled] [ocplib-endian: dune build] [ppx_tools: dune build] [re: dune build] [sexplib0: dune build] [win-error: dune build]
-> compiled  win-error.1.0
Processing 80/150: [cmdliner: make all] [num: make opam-legacy] [ocaml-compiler-libs: dune build] [ocaml-migrate-parsetree: dune build] [ocamlbuild: make check-if-preinstalled] [ocplib-endian: dune build] [ppx_tools: dune build] [re: dune build] [sexplib0: dune build]
-> installed win-error.1.0
Processing 81/150: [cmdliner: make all] [num: make opam-legacy] [ocaml-compiler-libs: dune build] [ocaml-migrate-parsetree: dune build] [ocamlbuild: make check-if-preinstalled] [ocplib-endian: dune build] [ppx_tools: dune build] [re: dune build] [sexplib0: dune build]
-> compiled  sexplib0.v0.13.0
Processing 81/150: [cmdliner: make all] [num: make opam-legacy] [ocaml-compiler-libs: dune build] [ocaml-migrate-parsetree: dune build] [ocamlbuild: make check-if-preinstalled] [ocplib-endian: dune build] [ppx_tools: dune build] [re: dune build]
-> installed sexplib0.v0.13.0
Processing 82/150: [cmdliner: make all] [num: make opam-legacy] [ocaml-compiler-libs: dune build] [ocaml-migrate-parsetree: dune build] [ocamlbuild: make check-if-preinstalled] [ocplib-endian: dune build] [ppx_tools: dune build] [re: dune build]
Processing 83/150: [base: dune build] [cmdliner: make all] [num: make opam-legacy] [ocaml-compiler-libs: dune build] [ocaml-migrate-parsetree: dune build] [ocamlbuild: make check-if-preinstalled] [ocplib-endian: dune build] [ppx_tools: dune build] [re: dune build]
-> compiled  ocplib-endian.1.2
Processing 83/150: [base: dune build] [cmdliner: make all] [num: make opam-legacy] [ocaml-compiler-libs: dune build] [ocaml-migrate-parsetree: dune build] [ocamlbuild: make check-if-preinstalled] [ppx_tools: dune build] [re: dune build]
-> installed ocplib-endian.1.2
Processing 84/150: [base: dune build] [cmdliner: make all] [num: make opam-legacy] [ocaml-compiler-libs: dune build] [ocaml-migrate-parsetree: dune build] [ocamlbuild: make check-if-preinstalled] [ppx_tools: dune build] [re: dune build]
Processing 85/150: [base: dune build] [cmdliner: make all] [lwt: dune build] [num: make opam-legacy] [ocaml-compiler-libs: dune build] [ocaml-migrate-parsetree: dune build] [ocamlbuild: make check-if-preinstalled] [ppx_tools: dune build] [re: dune build]
-> compiled  ocaml-compiler-libs.v0.12.3
Processing 85/150: [base: dune build] [cmdliner: make all] [lwt: dune build] [num: make opam-legacy] [ocaml-migrate-parsetree: dune build] [ocamlbuild: make check-if-preinstalled] [ppx_tools: dune build] [re: dune build]
-> installed ocaml-compiler-libs.v0.12.3
Processing 86/150: [base: dune build] [cmdliner: make all] [lwt: dune build] [num: make opam-legacy] [ocaml-migrate-parsetree: dune build] [ocamlbuild: make check-if-preinstalled] [ppx_tools: dune build] [re: dune build]
-> compiled  re.1.9.0
Processing 86/150: [base: dune build] [cmdliner: make all] [lwt: dune build] [num: make opam-legacy] [ocaml-migrate-parsetree: dune build] [ocamlbuild: make check-if-preinstalled] [ppx_tools: dune build]
-> installed re.1.9.0
Processing 87/150: [base: dune build] [cmdliner: make all] [lwt: dune build] [num: make opam-legacy] [ocaml-migrate-parsetree: dune build] [ocamlbuild: make check-if-preinstalled] [ppx_tools: dune build]
- /usr/bin/make -C src all
- make[1]: Entering directory '/home/opam/.opam/4.11/.opam-switch/build/num.1.5/src'
- ocamlc -ccopt -DBNG_ARCH_amd64 -c bng.c
- ocamlc -ccopt -DBNG_ARCH_amd64 -c nat_stubs.c
- ocamlmklib -oc nums bng.o nat_stubs.o
- ocamlc -w +a-4-9-41-42-44-45-48  -bin-annot -g -safe-string -strict-sequence -strict-formats -I +compiler-libs -c int_misc.mli
- ocamlc -w +a-4-9-41-42-44-45-48  -bin-annot -g -safe-string -strict-sequence -strict-formats -I +compiler-libs -c int_misc.ml
- ocamlc -w +a-4-9-41-42-44-45-48  -bin-annot -g -safe-string -strict-sequence -strict-formats -I +compiler-libs -c nat.mli
- ocamlc -w +a-4-9-41-42-44-45-48  -bin-annot -g -safe-string -strict-sequence -strict-formats -I +compiler-libs -c nat.ml
- ocamlc -w +a-4-9-41-42-44-45-48  -bin-annot -g -safe-string -strict-sequence -strict-formats -I +compiler-libs -c big_int.mli
- ocamlc -w +a-4-9-41-42-44-45-48  -bin-annot -g -safe-string -strict-sequence -strict-formats -I +compiler-libs -c big_int.ml
- ocamlc -w +a-4-9-41-42-44-45-48  -bin-annot -g -safe-string -strict-sequence -strict-formats -I +compiler-libs -c arith_flags.mli
- ocamlc -w +a-4-9-41-42-44-45-48  -bin-annot -g -safe-string -strict-sequence -strict-formats -I +compiler-libs -c arith_flags.ml
- ocamlc -w +a-4-9-41-42-44-45-48  -bin-annot -g -safe-string -strict-sequence -strict-formats -I +compiler-libs -c ratio.mli
- ocamlc -w +a-4-9-41-42-44-45-48  -bin-annot -g -safe-string -strict-sequence -strict-formats -I +compiler-libs -c ratio.ml
- ocamlc -w +a-4-9-41-42-44-45-48  -bin-annot -g -safe-string -strict-sequence -strict-formats -I +compiler-libs -c num.mli
- ocamlc -w +a-4-9-41-42-44-45-48  -bin-annot -g -safe-string -strict-sequence -strict-formats -I +compiler-libs -c num.ml
- ocamlc -w +a-4-9-41-42-44-45-48  -bin-annot -g -safe-string -strict-sequence -strict-formats -I +compiler-libs -c arith_status.mli
- ocamlc -w +a-4-9-41-42-44-45-48  -bin-annot -g -safe-string -strict-sequence -strict-formats -I +compiler-libs -c arith_status.ml
- ocamlmklib -o nums -oc nums -linkall int_misc.cmo nat.cmo big_int.cmo arith_flags.cmo ratio.cmo num.cmo arith_status.cmo
- cp ../toplevel/num_top_printers.mli ../toplevel/num_top.mli ../toplevel/num_top_printers.ml ../toplevel/num_top.ml .
- ocamlc -w +a-4-9-41-42-44-45-48  -bin-annot -g -safe-string -strict-sequence -strict-formats -I +compiler-libs -c num_top_printers.mli
- ocamlc -w +a-4-9-41-42-44-45-48  -bin-annot -g -safe-string -strict-sequence -strict-formats -I +compiler-libs -c num_top_printers.ml
- ocamlc -w +a-4-9-41-42-44-45-48  -bin-annot -g -safe-string -strict-sequence -strict-formats -I +compiler-libs -c num_top.mli
- ocamlc -w +a-4-9-41-42-44-45-48  -bin-annot -g -safe-string -strict-sequence -strict-formats -I +compiler-libs -c num_top.ml
- ocamlc -w +a-4-9-41-42-44-45-48  -bin-annot -g -safe-string -strict-sequence -strict-formats -I +compiler-libs -a -o num_top.cma num_top_printers.cmo num_top.cmo
- echo 'version = "1.6~dev"' > META.top
- cat META.num-top.in >> META.top
- ocamlopt -w +a-4-9-41-42-44-45-48  -bin-annot -g -safe-string -strict-sequence -strict-formats -I +compiler-libs -c int_misc.ml
- ocamlopt -w +a-4-9-41-42-44-45-48  -bin-annot -g -safe-string -strict-sequence -strict-formats -I +compiler-libs -c nat.ml
- ocamlopt -w +a-4-9-41-42-44-45-48  -bin-annot -g -safe-string -strict-sequence -strict-formats -I +compiler-libs -c big_int.ml
- ocamlopt -w +a-4-9-41-42-44-45-48  -bin-annot -g -safe-string -strict-sequence -strict-formats -I +compiler-libs -c arith_flags.ml
- ocamlopt -w +a-4-9-41-42-44-45-48  -bin-annot -g -safe-string -strict-sequence -strict-formats -I +compiler-libs -c ratio.ml
- ocamlopt -w +a-4-9-41-42-44-45-48  -bin-annot -g -safe-string -strict-sequence -strict-formats -I +compiler-libs -c num.ml
- ocamlopt -w +a-4-9-41-42-44-45-48  -bin-annot -g -safe-string -strict-sequence -strict-formats -I +compiler-libs -c arith_status.ml
- ocamlmklib -o nums -oc nums -linkall int_misc.cmx nat.cmx big_int.cmx arith_flags.cmx ratio.cmx num.cmx arith_status.cmx
- ocamlopt -w +a-4-9-41-42-44-45-48  -bin-annot -g -safe-string -strict-sequence -strict-formats -I +compiler-libs -I . -shared -o nums.cmxs nums.cmxa
- make[1]: Leaving directory '/home/opam/.opam/4.11/.opam-switch/build/num.1.5/src'
- cp src/num-legacy.install num.install
-> compiled  num.1.5
Processing 87/150: [base: dune build] [cmdliner: make all] [lwt: dune build] [ocaml-migrate-parsetree: dune build] [ocamlbuild: make check-if-preinstalled] [ppx_tools: dune build]
-> installed num.1.5
Processing 88/150: [base: dune build] [cmdliner: make all] [lwt: dune build] [ocaml-migrate-parsetree: dune build] [ocamlbuild: make check-if-preinstalled] [ppx_tools: dune build]
- ocaml build.ml cma
- ocaml build.ml cmxa
- ocaml build.ml cmxs
-> compiled  cmdliner.1.2.0
Processing 88/150: [base: dune build] [lwt: dune build] [ocaml-migrate-parsetree: dune build] [ocamlbuild: make check-if-preinstalled] [ppx_tools: dune build]
Processing 89/150: [base: dune build] [lwt: dune build] [ocaml-migrate-parsetree: dune build] [ocamlbuild: make check-if-preinstalled] [ppx_tools: dune build] [cmdliner: make install]
- install -d "/home/opam/.opam/4.11/lib/cmdliner"
- install pkg/META _build/cmdliner.mli _build/cmdliner.cmi _build/cmdliner.cmti "/home/opam/.opam/4.11/lib/cmdliner"
- install cmdliner.opam "/home/opam/.opam/4.11/lib/cmdliner/opam"
- install _build/cmdliner.cma "/home/opam/.opam/4.11/lib/cmdliner"
- install _build/cmdliner.cmxa _build/cmdliner.a _build/cmdliner.cmx _build/cmdliner_arg.cmx _build/cmdliner_base.cmx _build/cmdliner_cline.cmx _build/cmdliner_cmd.cmx _build/cmdliner_docgen.cmx _build/cmdliner_eval.cmx _build/cmdliner_exit.cmx _build/cmdliner_info.cmx _build/cmdliner_manpage.cmx _build/cmdliner_msg.cmx _build/cmdliner_term.cmx _build/cmdliner_term_deprecated.cmx _build/cmdliner_trie.cmx \
-   "/home/opam/.opam/4.11/lib/cmdliner"
- install _build/cmdliner.cmxs "/home/opam/.opam/4.11/lib/cmdliner"
Processing 89/150: [base: dune build] [lwt: dune build] [ocaml-migrate-parsetree: dune build] [ocamlbuild: make check-if-preinstalled] [ppx_tools: dune build] [cmdliner: make install-doc]
- install -d "/home/opam/.opam/4.11/doc/cmdliner/odoc-pages"
- install CHANGES.md LICENSE.md README.md "/home/opam/.opam/4.11/doc/cmdliner"
- install doc/index.mld doc/cli.mld doc/examples.mld doc/tutorial.mld \
-            doc/tool_man.mld "/home/opam/.opam/4.11/doc/cmdliner/odoc-pages"
-> installed cmdliner.1.2.0
Processing 89/150: [base: dune build] [lwt: dune build] [ocaml-migrate-parsetree: dune build] [ocamlbuild: make check-if-preinstalled] [ppx_tools: dune build]
-> compiled  ppx_tools.6.6
Processing 89/150: [base: dune build] [lwt: dune build] [ocaml-migrate-parsetree: dune build] [ocamlbuild: make check-if-preinstalled]
-> installed ppx_tools.6.6
Processing 90/150: [base: dune build] [lwt: dune build] [ocaml-migrate-parsetree: dune build] [ocamlbuild: make check-if-preinstalled]
-       ocamlc src/unix/lwt_unix_stubs.o
- lwt_unix_stubs.c: In function 'lwt_unix_blit_to_bytes':
- lwt_unix_stubs.c:134:31: warning: passing argument 1 of 'memcpy' discards 'const' qualifier from pointer target type [-Wdiscarded-qualifiers]
-   134 |   memcpy(String_val(val_buf2) + Long_val(val_ofs2),
- In file included from /usr/include/x86_64-linux-gnu/sys/un.h:37,
-                  from /home/opam/.opam/4.11/lib/ocaml/caml/socketaddr.h:22,
-                  from lwt_unix.h:15,
-                  from lwt_unix_stubs.c:35:
- /usr/include/string.h:43:39: note: expected 'void * restrict' but argument is of type 'const char *'
-    43 | extern void *memcpy (void *__restrict __dest, const void *__restrict __src,
-       |                      ~~~~~~~~~~~~~~~~~^~~~~~
-> compiled  lwt.4.5.0
Processing 90/150: [base: dune build] [ocaml-migrate-parsetree: dune build] [ocamlbuild: make check-if-preinstalled]
-> installed lwt.4.5.0
Processing 91/150: [base: dune build] [ocaml-migrate-parsetree: dune build] [ocamlbuild: make check-if-preinstalled]
- if test -d /home/opam/.opam/4.11/lib/ocaml/ocamlbuild; then\
-   >&2 echo "ERROR: Preinstalled ocamlbuild detected at"\
-        "/home/opam/.opam/4.11/lib/ocaml/ocamlbuild";\
-   >&2 echo "Installation aborted; if you want to bypass this"\
-         "safety check, pass CHECK_IF_PREINSTALLED=false to make";\
-   exit 2;\
- fi
- ocamlc.opt -w +L -w +R -w +Z -I src -I plugin-lib -I bin -I +unix -safe-string -bin-annot -strict-sequence -c src/const.ml
- ocamlc.opt -w +L -w +R -w +Z -I src -I plugin-lib -I bin -I +unix -safe-string -bin-annot -strict-sequence -c src/loc.mli
- ocamlc.opt -w +L -w +R -w +Z -I src -I plugin-lib -I bin -I +unix -safe-string -bin-annot -strict-sequence -c src/loc.ml
- ocamlc.opt -w +L -w +R -w +Z -I src -I plugin-lib -I bin -I +unix -safe-string -bin-annot -strict-sequence -c src/discard_printf.mli
- ocamlc.opt -w +L -w +R -w +Z -I src -I plugin-lib -I bin -I +unix -safe-string -bin-annot -strict-sequence -c src/discard_printf.ml
- ocamlc.opt -w +L -w +R -w +Z -I src -I plugin-lib -I bin -I +unix -safe-string -bin-annot -strict-sequence -c src/signatures.mli
- ocamlc.opt -w +L -w +R -w +Z -I src -I plugin-lib -I bin -I +unix -safe-string -bin-annot -strict-sequence -c src/my_std.mli
- ocamlc.opt -w +L -w +R -w +Z -I src -I plugin-lib -I bin -I +unix -safe-string -bin-annot -strict-sequence -c src/my_std.ml
- ocamlc.opt -w +L -w +R -w +Z -I src -I plugin-lib -I bin -I +unix -safe-string -bin-annot -strict-sequence -c src/my_unix.mli
- ocamlc.opt -w +L -w +R -w +Z -I src -I plugin-lib -I bin -I +unix -safe-string -bin-annot -strict-sequence -c src/my_unix.ml
- ocamlc.opt -w +L -w +R -w +Z -I src -I plugin-lib -I bin -I +unix -safe-string -bin-annot -strict-sequence -c src/tags.mli
- ocamlc.opt -w +L -w +R -w +Z -I src -I plugin-lib -I bin -I +unix -safe-string -bin-annot -strict-sequence -c src/tags.ml
- ocamlc.opt -w +L -w +R -w +Z -I src -I plugin-lib -I bin -I +unix -safe-string -bin-annot -strict-sequence -c src/display.mli
- ocamlc.opt -w +L -w +R -w +Z -I src -I plugin-lib -I bin -I +unix -safe-string -bin-annot -strict-sequence -c src/display.ml
- ocamlc.opt -w +L -w +R -w +Z -I src -I plugin-lib -I bin -I +unix -safe-string -bin-annot -strict-sequence -c src/log.mli
- ocamlc.opt -w +L -w +R -w +Z -I src -I plugin-lib -I bin -I +unix -safe-string -bin-annot -strict-sequence -c src/log.ml
- ocamlc.opt -w +L -w +R -w +Z -I src -I plugin-lib -I bin -I +unix -safe-string -bin-annot -strict-sequence -c src/shell.mli
- ocamlc.opt -w +L -w +R -w +Z -I src -I plugin-lib -I bin -I +unix -safe-string -bin-annot -strict-sequence -c src/shell.ml
- ocamlc.opt -w +L -w +R -w +Z -I src -I plugin-lib -I bin -I +unix -safe-string -bin-annot -strict-sequence -c src/bool.mli
- ocamlc.opt -w +L -w +R -w +Z -I src -I plugin-lib -I bin -I +unix -safe-string -bin-annot -strict-sequence -c src/bool.ml
- ocamlc.opt -w +L -w +R -w +Z -I src -I plugin-lib -I bin -I +unix -safe-string -bin-annot -strict-sequence -c src/glob_ast.mli
- ocamlc.opt -w +L -w +R -w +Z -I src -I plugin-lib -I bin -I +unix -safe-string -bin-annot -strict-sequence -c src/glob_ast.ml
- ocamllex.opt src/glob_lexer.mll
- 55 states, 419 transitions, table size 2006 bytes
- ocamlc.opt -w +L -w +R -w +Z -I src -I plugin-lib -I bin -I +unix -safe-string -bin-annot -strict-sequence -c src/glob_lexer.mli
- ocamlc.opt -w +L -w +R -w +Z -I src -I plugin-lib -I bin -I +unix -safe-string -bin-annot -strict-sequence -c src/glob_lexer.ml
- ocamlc.opt -w +L -w +R -w +Z -I src -I plugin-lib -I bin -I +unix -safe-string -bin-annot -strict-sequence -c src/glob.mli
- ocamlc.opt -w +L -w +R -w +Z -I src -I plugin-lib -I bin -I +unix -safe-string -bin-annot -strict-sequence -c src/glob.ml
- ocamllex.opt src/lexers.mll
- 251 states, 1051 transitions, table size 5710 bytes
- 4334 additional bytes used for bindings
- ocamlc.opt -w +L -w +R -w +Z -I src -I plugin-lib -I bin -I +unix -safe-string -bin-annot -strict-sequence -c src/lexers.mli
- ocamlc.opt -w +L -w +R -w +Z -I src -I plugin-lib -I bin -I +unix -safe-string -bin-annot -strict-sequence -c src/lexers.ml
- ocamlc.opt -w +L -w +R -w +Z -I src -I plugin-lib -I bin -I +unix -safe-string -bin-annot -strict-sequence -c src/param_tags.mli
- ocamlc.opt -w +L -w +R -w +Z -I src -I plugin-lib -I bin -I +unix -safe-string -bin-annot -strict-sequence -c src/param_tags.ml
- ocamlc.opt -w +L -w +R -w +Z -I src -I plugin-lib -I bin -I +unix -safe-string -bin-annot -strict-sequence -c src/command.mli
- ocamlc.opt -w +L -w +R -w +Z -I src -I plugin-lib -I bin -I +unix -safe-string -bin-annot -strict-sequence -c src/command.ml
- ocamlc.opt -w +L -w +R -w +Z -I src -I plugin-lib -I bin -I +unix -safe-string -bin-annot -strict-sequence -c src/ocamlbuild_config.ml
- ocamlc.opt -w +L -w +R -w +Z -I src -I plugin-lib -I bin -I +unix -safe-string -bin-annot -strict-sequence -c src/ocamlbuild_where.mli
- ocamlc.opt -w +L -w +R -w +Z -I src -I plugin-lib -I bin -I +unix -safe-string -bin-annot -strict-sequence -c src/ocamlbuild_where.ml
- ocamlc.opt -w +L -w +R -w +Z -I src -I plugin-lib -I bin -I +unix -safe-string -bin-annot -strict-sequence -c src/slurp.mli
- ocamlc.opt -w +L -w +R -w +Z -I src -I plugin-lib -I bin -I +unix -safe-string -bin-annot -strict-sequence -c src/slurp.ml
- ocamlc.opt -w +L -w +R -w +Z -I src -I plugin-lib -I bin -I +unix -safe-string -bin-annot -strict-sequence -c src/options.mli
- ocamlc.opt -w +L -w +R -w +Z -I src -I plugin-lib -I bin -I +unix -safe-string -bin-annot -strict-sequence -c src/options.ml
- ocamlc.opt -w +L -w +R -w +Z -I src -I plugin-lib -I bin -I +unix -safe-string -bin-annot -strict-sequence -c src/pathname.mli
- ocamlc.opt -w +L -w +R -w +Z -I src -I plugin-lib -I bin -I +unix -safe-string -bin-annot -strict-sequence -c src/pathname.ml
- ocamlc.opt -w +L -w +R -w +Z -I src -I plugin-lib -I bin -I +unix -safe-string -bin-annot -strict-sequence -c src/configuration.mli
- ocamlc.opt -w +L -w +R -w +Z -I src -I plugin-lib -I bin -I +unix -safe-string -bin-annot -strict-sequence -c src/configuration.ml
- ocamlc.opt -w +L -w +R -w +Z -I src -I plugin-lib -I bin -I +unix -safe-string -bin-annot -strict-sequence -c src/flags.mli
- ocamlc.opt -w +L -w +R -w +Z -I src -I plugin-lib -I bin -I +unix -safe-string -bin-annot -strict-sequence -c src/flags.ml
- ocamlc.opt -w +L -w +R -w +Z -I src -I plugin-lib -I bin -I +unix -safe-string -bin-annot -strict-sequence -c src/hygiene.mli
- ocamlc.opt -w +L -w +R -w +Z -I src -I plugin-lib -I bin -I +unix -safe-string -bin-annot -strict-sequence -c src/hygiene.ml
- ocamlc.opt -w +L -w +R -w +Z -I src -I plugin-lib -I bin -I +unix -safe-string -bin-annot -strict-sequence -c src/digest_cache.mli
- ocamlc.opt -w +L -w +R -w +Z -I src -I plugin-lib -I bin -I +unix -safe-string -bin-annot -strict-sequence -c src/digest_cache.ml
- ocamlc.opt -w +L -w +R -w +Z -I src -I plugin-lib -I bin -I +unix -safe-string -bin-annot -strict-sequence -c src/resource.mli
- ocamlc.opt -w +L -w +R -w +Z -I src -I plugin-lib -I bin -I +unix -safe-string -bin-annot -strict-sequence -c src/resource.ml
- ocamlc.opt -w +L -w +R -w +Z -I src -I plugin-lib -I bin -I +unix -safe-string -bin-annot -strict-sequence -c src/rule.mli
- ocamlc.opt -w +L -w +R -w +Z -I src -I plugin-lib -I bin -I +unix -safe-string -bin-annot -strict-sequence -c src/rule.ml
- ocamlc.opt -w +L -w +R -w +Z -I src -I plugin-lib -I bin -I +unix -safe-string -bin-annot -strict-sequence -c src/solver.mli
- ocamlc.opt -w +L -w +R -w +Z -I src -I plugin-lib -I bin -I +unix -safe-string -bin-annot -strict-sequence -c src/solver.ml
- ocamlc.opt -w +L -w +R -w +Z -I src -I plugin-lib -I bin -I +unix -safe-string -bin-annot -strict-sequence -c src/report.mli
- ocamlc.opt -w +L -w +R -w +Z -I src -I plugin-lib -I bin -I +unix -safe-string -bin-annot -strict-sequence -c src/report.ml
- ocamlc.opt -w +L -w +R -w +Z -I src -I plugin-lib -I bin -I +unix -safe-string -bin-annot -strict-sequence -c src/tools.mli
- ocamlc.opt -w +L -w +R -w +Z -I src -I plugin-lib -I bin -I +unix -safe-string -bin-annot -strict-sequence -c src/tools.ml
- ocamlc.opt -w +L -w +R -w +Z -I src -I plugin-lib -I bin -I +unix -safe-string -bin-annot -strict-sequence -c src/fda.mli
- ocamlc.opt -w +L -w +R -w +Z -I src -I plugin-lib -I bin -I +unix -safe-string -bin-annot -strict-sequence -c src/fda.ml
- ocamlc.opt -w +L -w +R -w +Z -I src -I plugin-lib -I bin -I +unix -safe-string -bin-annot -strict-sequence -c src/findlib.mli
- ocamlc.opt -w +L -w +R -w +Z -I src -I plugin-lib -I bin -I +unix -safe-string -bin-annot -strict-sequence -c src/findlib.ml
- ocamlc.opt -w +L -w +R -w +Z -I src -I plugin-lib -I bin -I +unix -safe-string -bin-annot -strict-sequence -c src/ocaml_arch.mli
- ocamlc.opt -w +L -w +R -w +Z -I src -I plugin-lib -I bin -I +unix -safe-string -bin-annot -strict-sequence -c src/ocaml_arch.ml
- ocamlc.opt -w +L -w +R -w +Z -I src -I plugin-lib -I bin -I +unix -safe-string -bin-annot -strict-sequence -c src/ocaml_utils.mli
- ocamlc.opt -w +L -w +R -w +Z -I src -I plugin-lib -I bin -I +unix -safe-string -bin-annot -strict-sequence -c src/ocaml_utils.ml
- ocamlc.opt -w +L -w +R -w +Z -I src -I plugin-lib -I bin -I +unix -safe-string -bin-annot -strict-sequence -c src/ocaml_dependencies.mli
- ocamlc.opt -w +L -w +R -w +Z -I src -I plugin-lib -I bin -I +unix -safe-string -bin-annot -strict-sequence -c src/ocaml_dependencies.ml
- ocamlc.opt -w +L -w +R -w +Z -I src -I plugin-lib -I bin -I +unix -safe-string -bin-annot -strict-sequence -c src/ocaml_compiler.mli
- ocamlc.opt -w +L -w +R -w +Z -I src -I plugin-lib -I bin -I +unix -safe-string -bin-annot -strict-sequence -c src/ocaml_compiler.ml
- ocamlc.opt -w +L -w +R -w +Z -I src -I plugin-lib -I bin -I +unix -safe-string -bin-annot -strict-sequence -c src/ocaml_tools.mli
- ocamlc.opt -w +L -w +R -w +Z -I src -I plugin-lib -I bin -I +unix -safe-string -bin-annot -strict-sequence -c src/ocaml_tools.ml
- ocamlc.opt -w +L -w +R -w +Z -I src -I plugin-lib -I bin -I +unix -safe-string -bin-annot -strict-sequence -c src/ocaml_specific.mli
- ocamlc.opt -w +L -w +R -w +Z -I src -I plugin-lib -I bin -I +unix -safe-string -bin-annot -strict-sequence -c src/ocaml_specific.ml
- ocamlc.opt -w +L -w +R -w +Z -I src -I plugin-lib -I bin -I +unix -safe-string -bin-annot -strict-sequence -c src/exit_codes.mli
- ocamlc.opt -w +L -w +R -w +Z -I src -I plugin-lib -I bin -I +unix -safe-string -bin-annot -strict-sequence -c src/exit_codes.ml
- ocamlc.opt -w +L -w +R -w +Z -I src -I plugin-lib -I bin -I +unix -safe-string -bin-annot -strict-sequence -c src/plugin.mli
- ocamlc.opt -w +L -w +R -w +Z -I src -I plugin-lib -I bin -I +unix -safe-string -bin-annot -strict-sequence -c src/plugin.ml
- ocamlc.opt -w +L -w +R -w +Z -I src -I plugin-lib -I bin -I +unix -safe-string -bin-annot -strict-sequence -c src/hooks.mli
- ocamlc.opt -w +L -w +R -w +Z -I src -I plugin-lib -I bin -I +unix -safe-string -bin-annot -strict-sequence -c src/hooks.ml
- ocamlc.opt -w +L -w +R -w +Z -I src -I plugin-lib -I bin -I +unix -safe-string -bin-annot -strict-sequence -c src/main.mli
- ocamlc.opt -w +L -w +R -w +Z -I src -I plugin-lib -I bin -I +unix -safe-string -bin-annot -strict-sequence -c src/main.ml
- mkdir -p tmp
- ocamlc.opt -pack src/const.cmo src/loc.cmo src/discard_printf.cmo src/signatures.cmi src/my_std.cmo src/my_unix.cmo src/tags.cmo src/display.cmo src/log.cmo src/shell.cmo src/bool.cmo src/glob_ast.cmo src/glob_lexer.cmo src/glob.cmo src/lexers.cmo src/param_tags.cmo src/command.cmo src/ocamlbuild_config.cmo src/ocamlbuild_where.cmo src/slurp.cmo src/options.cmo src/pathname.cmo src/configuration.cmo src/flags.cmo src/hygiene.cmo src/digest_cache.cmo src/resource.cmo src/rule.cmo src/solver.cmo src/report.cmo src/tools.cmo src/fda.cmo src/findlib.cmo src/ocaml_arch.cmo src/ocaml_utils.cmo src/ocaml_dependencies.cmo src/ocaml_compiler.cmo src/ocaml_tools.cmo src/ocaml_specific.cmo src/exit_codes.cmo src/plugin.cmo src/hooks.cmo src/main.cmo -o tmp/ocamlbuild_pack.cmo
- mv tmp/ocamlbuild_pack.cmi src/ocamlbuild_pack.cmi
- mv tmp/ocamlbuild_pack.cmo src/ocamlbuild_pack.cmo
- ocamlc.opt -w +L -w +R -w +Z -I src -I plugin-lib -I bin -I +unix -safe-string -bin-annot -strict-sequence -c plugin-lib/ocamlbuild_plugin.mli
- ocamlc.opt -w +L -w +R -w +Z -I src -I plugin-lib -I bin -I +unix -safe-string -bin-annot -strict-sequence -c plugin-lib/ocamlbuild_plugin.ml
- ocamlc.opt -w +L -w +R -w +Z -I src -I plugin-lib -I bin -I +unix -safe-string -bin-annot -strict-sequence -c plugin-lib/ocamlbuild_executor.mli
- ocamlc.opt -w +L -w +R -w +Z -I src -I plugin-lib -I bin -I +unix -safe-string -bin-annot -strict-sequence -c plugin-lib/ocamlbuild_executor.ml
- ocamlc.opt -w +L -w +R -w +Z -I src -I plugin-lib -I bin -I +unix -safe-string -bin-annot -strict-sequence -c plugin-lib/ocamlbuild_unix_plugin.mli
- ocamlc.opt -w +L -w +R -w +Z -I src -I plugin-lib -I bin -I +unix -safe-string -bin-annot -strict-sequence -c plugin-lib/ocamlbuild_unix_plugin.ml
- ocamlc.opt -w +L -w +R -w +Z -I src -I plugin-lib -I bin -I +unix -safe-string -bin-annot -strict-sequence -c bin/ocamlbuild.mli
- ocamlc.opt -w +L -w +R -w +Z -I src -I plugin-lib -I bin -I +unix -safe-string -bin-annot -strict-sequence -c bin/ocamlbuild.ml
- ocamlc.opt -I +unix -I src -o ocamlbuild.byte unix.cma src/ocamlbuild_pack.cmo plugin-lib/ocamlbuild_plugin.cmo plugin-lib/ocamlbuild_executor.cmo plugin-lib/ocamlbuild_unix_plugin.cmo bin/ocamlbuild.cmo
- ocamlc.opt -a -o plugin-lib/ocamlbuildlib.cma src/ocamlbuild_pack.cmo plugin-lib/ocamlbuild_plugin.cmo plugin-lib/ocamlbuild_executor.cmo plugin-lib/ocamlbuild_unix_plugin.cmo
- ocamlopt.opt -for-pack Ocamlbuild_pack -w +L -w +R -w +Z -I src -I plugin-lib -I bin -I +unix -safe-string -bin-annot -strict-sequence -c src/const.ml
- ocamlopt.opt -for-pack Ocamlbuild_pack -w +L -w +R -w +Z -I src -I plugin-lib -I bin -I +unix -safe-string -bin-annot -strict-sequence -c src/loc.ml
- ocamlopt.opt -for-pack Ocamlbuild_pack -w +L -w +R -w +Z -I src -I plugin-lib -I bin -I +unix -safe-string -bin-annot -strict-sequence -c src/discard_printf.ml
- ocamlopt.opt -for-pack Ocamlbuild_pack -w +L -w +R -w +Z -I src -I plugin-lib -I bin -I +unix -safe-string -bin-annot -strict-sequence -c src/my_std.ml
- ocamlopt.opt -for-pack Ocamlbuild_pack -w +L -w +R -w +Z -I src -I plugin-lib -I bin -I +unix -safe-string -bin-annot -strict-sequence -c src/my_unix.ml
- ocamlopt.opt -for-pack Ocamlbuild_pack -w +L -w +R -w +Z -I src -I plugin-lib -I bin -I +unix -safe-string -bin-annot -strict-sequence -c src/tags.ml
- ocamlopt.opt -for-pack Ocamlbuild_pack -w +L -w +R -w +Z -I src -I plugin-lib -I bin -I +unix -safe-string -bin-annot -strict-sequence -c src/display.ml
- ocamlopt.opt -for-pack Ocamlbuild_pack -w +L -w +R -w +Z -I src -I plugin-lib -I bin -I +unix -safe-string -bin-annot -strict-sequence -c src/log.ml
- ocamlopt.opt -for-pack Ocamlbuild_pack -w +L -w +R -w +Z -I src -I plugin-lib -I bin -I +unix -safe-string -bin-annot -strict-sequence -c src/shell.ml
- ocamlopt.opt -for-pack Ocamlbuild_pack -w +L -w +R -w +Z -I src -I plugin-lib -I bin -I +unix -safe-string -bin-annot -strict-sequence -c src/bool.ml
- ocamlopt.opt -for-pack Ocamlbuild_pack -w +L -w +R -w +Z -I src -I plugin-lib -I bin -I +unix -safe-string -bin-annot -strict-sequence -c src/glob_ast.ml
- ocamlopt.opt -for-pack Ocamlbuild_pack -w +L -w +R -w +Z -I src -I plugin-lib -I bin -I +unix -safe-string -bin-annot -strict-sequence -c src/glob_lexer.ml
- ocamlopt.opt -for-pack Ocamlbuild_pack -w +L -w +R -w +Z -I src -I plugin-lib -I bin -I +unix -safe-string -bin-annot -strict-sequence -c src/glob.ml
- ocamlopt.opt -for-pack Ocamlbuild_pack -w +L -w +R -w +Z -I src -I plugin-lib -I bin -I +unix -safe-string -bin-annot -strict-sequence -c src/lexers.ml
- ocamlopt.opt -for-pack Ocamlbuild_pack -w +L -w +R -w +Z -I src -I plugin-lib -I bin -I +unix -safe-string -bin-annot -strict-sequence -c src/param_tags.ml
- ocamlopt.opt -for-pack Ocamlbuild_pack -w +L -w +R -w +Z -I src -I plugin-lib -I bin -I +unix -safe-string -bin-annot -strict-sequence -c src/command.ml
- ocamlopt.opt -for-pack Ocamlbuild_pack -w +L -w +R -w +Z -I src -I plugin-lib -I bin -I +unix -safe-string -bin-annot -strict-sequence -c src/ocamlbuild_config.ml
- ocamlopt.opt -for-pack Ocamlbuild_pack -w +L -w +R -w +Z -I src -I plugin-lib -I bin -I +unix -safe-string -bin-annot -strict-sequence -c src/ocamlbuild_where.ml
- ocamlopt.opt -for-pack Ocamlbuild_pack -w +L -w +R -w +Z -I src -I plugin-lib -I bin -I +unix -safe-string -bin-annot -strict-sequence -c src/slurp.ml
- ocamlopt.opt -for-pack Ocamlbuild_pack -w +L -w +R -w +Z -I src -I plugin-lib -I bin -I +unix -safe-string -bin-annot -strict-sequence -c src/options.ml
- ocamlopt.opt -for-pack Ocamlbuild_pack -w +L -w +R -w +Z -I src -I plugin-lib -I bin -I +unix -safe-string -bin-annot -strict-sequence -c src/pathname.ml
- ocamlopt.opt -for-pack Ocamlbuild_pack -w +L -w +R -w +Z -I src -I plugin-lib -I bin -I +unix -safe-string -bin-annot -strict-sequence -c src/configuration.ml
- ocamlopt.opt -for-pack Ocamlbuild_pack -w +L -w +R -w +Z -I src -I plugin-lib -I bin -I +unix -safe-string -bin-annot -strict-sequence -c src/flags.ml
- ocamlopt.opt -for-pack Ocamlbuild_pack -w +L -w +R -w +Z -I src -I plugin-lib -I bin -I +unix -safe-string -bin-annot -strict-sequence -c src/hygiene.ml
- ocamlopt.opt -for-pack Ocamlbuild_pack -w +L -w +R -w +Z -I src -I plugin-lib -I bin -I +unix -safe-string -bin-annot -strict-sequence -c src/digest_cache.ml
- ocamlopt.opt -for-pack Ocamlbuild_pack -w +L -w +R -w +Z -I src -I plugin-lib -I bin -I +unix -safe-string -bin-annot -strict-sequence -c src/resource.ml
- ocamlopt.opt -for-pack Ocamlbuild_pack -w +L -w +R -w +Z -I src -I plugin-lib -I bin -I +unix -safe-string -bin-annot -strict-sequence -c src/rule.ml
- ocamlopt.opt -for-pack Ocamlbuild_pack -w +L -w +R -w +Z -I src -I plugin-lib -I bin -I +unix -safe-string -bin-annot -strict-sequence -c src/solver.ml
- ocamlopt.opt -for-pack Ocamlbuild_pack -w +L -w +R -w +Z -I src -I plugin-lib -I bin -I +unix -safe-string -bin-annot -strict-sequence -c src/report.ml
- ocamlopt.opt -for-pack Ocamlbuild_pack -w +L -w +R -w +Z -I src -I plugin-lib -I bin -I +unix -safe-string -bin-annot -strict-sequence -c src/tools.ml
- ocamlopt.opt -for-pack Ocamlbuild_pack -w +L -w +R -w +Z -I src -I plugin-lib -I bin -I +unix -safe-string -bin-annot -strict-sequence -c src/fda.ml
- ocamlopt.opt -for-pack Ocamlbuild_pack -w +L -w +R -w +Z -I src -I plugin-lib -I bin -I +unix -safe-string -bin-annot -strict-sequence -c src/findlib.ml
- ocamlopt.opt -for-pack Ocamlbuild_pack -w +L -w +R -w +Z -I src -I plugin-lib -I bin -I +unix -safe-string -bin-annot -strict-sequence -c src/ocaml_arch.ml
- ocamlopt.opt -for-pack Ocamlbuild_pack -w +L -w +R -w +Z -I src -I plugin-lib -I bin -I +unix -safe-string -bin-annot -strict-sequence -c src/ocaml_utils.ml
- ocamlopt.opt -for-pack Ocamlbuild_pack -w +L -w +R -w +Z -I src -I plugin-lib -I bin -I +unix -safe-string -bin-annot -strict-sequence -c src/ocaml_dependencies.ml
- ocamlopt.opt -for-pack Ocamlbuild_pack -w +L -w +R -w +Z -I src -I plugin-lib -I bin -I +unix -safe-string -bin-annot -strict-sequence -c src/ocaml_compiler.ml
- ocamlopt.opt -for-pack Ocamlbuild_pack -w +L -w +R -w +Z -I src -I plugin-lib -I bin -I +unix -safe-string -bin-annot -strict-sequence -c src/ocaml_tools.ml
- ocamlopt.opt -for-pack Ocamlbuild_pack -w +L -w +R -w +Z -I src -I plugin-lib -I bin -I +unix -safe-string -bin-annot -strict-sequence -c src/ocaml_specific.ml
- ocamlopt.opt -for-pack Ocamlbuild_pack -w +L -w +R -w +Z -I src -I plugin-lib -I bin -I +unix -safe-string -bin-annot -strict-sequence -c src/exit_codes.ml
- ocamlopt.opt -for-pack Ocamlbuild_pack -w +L -w +R -w +Z -I src -I plugin-lib -I bin -I +unix -safe-string -bin-annot -strict-sequence -c src/plugin.ml
- ocamlopt.opt -for-pack Ocamlbuild_pack -w +L -w +R -w +Z -I src -I plugin-lib -I bin -I +unix -safe-string -bin-annot -strict-sequence -c src/hooks.ml
- ocamlopt.opt -for-pack Ocamlbuild_pack -w +L -w +R -w +Z -I src -I plugin-lib -I bin -I +unix -safe-string -bin-annot -strict-sequence -c src/main.ml
- mkdir -p tmp
- ocamlopt.opt -pack src/const.cmx src/loc.cmx src/discard_printf.cmx src/signatures.cmi src/my_std.cmx src/my_unix.cmx src/tags.cmx src/display.cmx src/log.cmx src/shell.cmx src/bool.cmx src/glob_ast.cmx src/glob_lexer.cmx src/glob.cmx src/lexers.cmx src/param_tags.cmx src/command.cmx src/ocamlbuild_config.cmx src/ocamlbuild_where.cmx src/slurp.cmx src/options.cmx src/pathname.cmx src/configuration.cmx src/flags.cmx src/hygiene.cmx src/digest_cache.cmx src/resource.cmx src/rule.cmx src/solver.cmx src/report.cmx src/tools.cmx src/fda.cmx src/findlib.cmx src/ocaml_arch.cmx src/ocaml_utils.cmx src/ocaml_dependencies.cmx src/ocaml_compiler.cmx src/ocaml_tools.cmx src/ocaml_specific.cmx src/exit_codes.cmx src/plugin.cmx src/hooks.cmx src/main.cmx -o tmp/ocamlbuild_pack.cmx
- mv tmp/ocamlbuild_pack.cmx src/ocamlbuild_pack.cmx
- mv tmp/ocamlbuild_pack.o src/ocamlbuild_pack.o
- ocamlopt.opt -w +L -w +R -w +Z -I src -I plugin-lib -I bin -I +unix -safe-string -bin-annot -strict-sequence -c plugin-lib/ocamlbuild_plugin.ml
- ocamlopt.opt -w +L -w +R -w +Z -I src -I plugin-lib -I bin -I +unix -safe-string -bin-annot -strict-sequence -c plugin-lib/ocamlbuild_executor.ml
- ocamlopt.opt -w +L -w +R -w +Z -I src -I plugin-lib -I bin -I +unix -safe-string -bin-annot -strict-sequence -c plugin-lib/ocamlbuild_unix_plugin.ml
- ocamlopt.opt -w +L -w +R -w +Z -I src -I plugin-lib -I bin -I +unix -safe-string -bin-annot -strict-sequence -c bin/ocamlbuild.ml
- ocamlopt.opt -I +unix -I src -o ocamlbuild.native unix.cmxa src/ocamlbuild_pack.cmx plugin-lib/ocamlbuild_plugin.cmx plugin-lib/ocamlbuild_executor.cmx plugin-lib/ocamlbuild_unix_plugin.cmx bin/ocamlbuild.cmx
- ocamlopt.opt -a -o plugin-lib/ocamlbuildlib.cmxa src/ocamlbuild_pack.cmx plugin-lib/ocamlbuild_plugin.cmx plugin-lib/ocamlbuild_executor.cmx plugin-lib/ocamlbuild_unix_plugin.cmx
- ocamlc.opt src/ocamlbuild_pack.cmo -I src man/options_man.ml -o man/options_man.byte
- ./man/options_man.byte > man/ocamlbuild.options.1
- cat man/ocamlbuild.header.1 man/ocamlbuild.options.1 man/ocamlbuild.footer.1 > man/ocamlbuild.1
- /usr/bin/make ocamlbuild.install
- make[1]: Entering directory '/home/opam/.opam/4.11/.opam-switch/build/ocamlbuild.0.14.3'
- rm -f ocamlbuild.install
- touch ocamlbuild.install
- /usr/bin/make install-bin-opam
- make[2]: Entering directory '/home/opam/.opam/4.11/.opam-switch/build/ocamlbuild.0.14.3'
- echo 'bin: [' >> ocamlbuild.install
- echo '  "ocamlbuild.byte" {"ocamlbuild.byte"}' >> ocamlbuild.install
- echo '  "ocamlbuild.native" {"ocamlbuild.native"}' >> ocamlbuild.install
- echo '  "ocamlbuild.native" {"ocamlbuild"}' >> ocamlbuild.install
- echo ']' >> ocamlbuild.install
- echo >> ocamlbuild.install
- make[2]: Leaving directory '/home/opam/.opam/4.11/.opam-switch/build/ocamlbuild.0.14.3'
- /usr/bin/make install-lib-opam
- make[2]: Entering directory '/home/opam/.opam/4.11/.opam-switch/build/ocamlbuild.0.14.3'
- echo 'lib: [' >> ocamlbuild.install
- /usr/bin/make install-lib-basics-opam
- make[3]: Entering directory '/home/opam/.opam/4.11/.opam-switch/build/ocamlbuild.0.14.3'
- echo '  "ocamlbuild.opam" {"opam"}' >> ocamlbuild.install
- echo '  "META"' >> ocamlbuild.install
- for lib in src/signatures.mli src/signatures.cmi src/signatures.cmti; do \
-   echo "  \"$lib\" {\"$(basename $lib)\"}" >> ocamlbuild.install; \
- done
- make[3]: Leaving directory '/home/opam/.opam/4.11/.opam-switch/build/ocamlbuild.0.14.3'
- /usr/bin/make install-lib-byte-opam
- make[3]: Entering directory '/home/opam/.opam/4.11/.opam-switch/build/ocamlbuild.0.14.3'
- for lib in plugin-lib/ocamlbuildlib.cma bin/ocamlbuild.cmo src/ocamlbuild_pack.cmi plugin-lib/ocamlbuild_plugin.cmi plugin-lib/ocamlbuild_executor.cmi plugin-lib/ocamlbuild_unix_plugin.cmi; do \
-   echo "  \"$lib\" {\"$(basename $lib)\"}" >> ocamlbuild.install; \
- done
- make[3]: Leaving directory '/home/opam/.opam/4.11/.opam-switch/build/ocamlbuild.0.14.3'
- /usr/bin/make install-lib-native-opam
- make[3]: Entering directory '/home/opam/.opam/4.11/.opam-switch/build/ocamlbuild.0.14.3'
- for lib in plugin-lib/ocamlbuildlib.cmxa plugin-lib/ocamlbuildlib.a bin/ocamlbuild.cmx bin/ocamlbuild.o src/ocamlbuild_pack.cmx plugin-lib/ocamlbuild_plugin.cmx plugin-lib/ocamlbuild_executor.cmx plugin-lib/ocamlbuild_unix_plugin.cmx plugin-lib/ocamlbuild_plugin.o plugin-lib/ocamlbuild_executor.o plugin-lib/ocamlbuild_unix_plugin.o; do \
-   echo "  \"$lib\" {\"$(basename $lib)\"}" >> ocamlbuild.install; \
- done
- make[3]: Leaving directory '/home/opam/.opam/4.11/.opam-switch/build/ocamlbuild.0.14.3'
- echo ']' >> ocamlbuild.install
- echo >> ocamlbuild.install
- make[2]: Leaving directory '/home/opam/.opam/4.11/.opam-switch/build/ocamlbuild.0.14.3'
- /usr/bin/make install-man-opam
- make[2]: Entering directory '/home/opam/.opam/4.11/.opam-switch/build/ocamlbuild.0.14.3'
- echo 'man: [' >> ocamlbuild.install
- echo '  "man/ocamlbuild.1" {"man1/ocamlbuild.1"}' >> ocamlbuild.install
- echo ']' >> ocamlbuild.install
- echo >> ocamlbuild.install
- make[2]: Leaving directory '/home/opam/.opam/4.11/.opam-switch/build/ocamlbuild.0.14.3'
- /usr/bin/make install-doc-opam
- make[2]: Entering directory '/home/opam/.opam/4.11/.opam-switch/build/ocamlbuild.0.14.3'
- echo 'doc: [' >> ocamlbuild.install
- echo '  "LICENSE"' >> ocamlbuild.install
- echo '  "Changes"' >> ocamlbuild.install
- echo '  "Readme.md"' >> ocamlbuild.install
- echo ']' >> ocamlbuild.install
- make[2]: Leaving directory '/home/opam/.opam/4.11/.opam-switch/build/ocamlbuild.0.14.3'
- make[1]: Leaving directory '/home/opam/.opam/4.11/.opam-switch/build/ocamlbuild.0.14.3'
-> compiled  ocamlbuild.0.14.3
Processing 91/150: [base: dune build] [ocaml-migrate-parsetree: dune build]
-> installed ocamlbuild.0.14.3
Processing 92/150: [base: dune build] [ocaml-migrate-parsetree: dune build]
Processing 93/150: [base: dune build] [ocaml-migrate-parsetree: dune build] [topkg: ocaml build]
-> compiled  ocaml-migrate-parsetree.1.8.0
Processing 93/150: [base: dune build] [topkg: ocaml build]
-> installed ocaml-migrate-parsetree.1.8.0
Processing 94/150: [base: dune build] [topkg: ocaml build]
Processing 95/150: [base: dune build] [ppxlib: dune build] [topkg: ocaml build]
-> compiled  base.v0.13.2
Processing 95/150: [ppxlib: dune build] [topkg: ocaml build]
-> installed base.v0.13.2
Processing 96/150: [ppxlib: dune build] [topkg: ocaml build]
Processing 97/150: [parsexp: dune build] [ppxlib: dune build] [topkg: ocaml build]
-> compiled  parsexp.v0.13.0
Processing 97/150: [ppxlib: dune build] [topkg: ocaml build]
-> installed parsexp.v0.13.0
Processing 98/150: [ppxlib: dune build] [topkg: ocaml build]
Processing 99/150: [ppxlib: dune build] [sexplib: dune build] [topkg: ocaml build]
-> compiled  sexplib.v0.13.0
Processing 99/150: [ppxlib: dune build] [topkg: ocaml build]
-> installed sexplib.v0.13.0
Processing 100/150: [ppxlib: dune build] [topkg: ocaml build]
Processing 101/150: [cstruct: dune build] [ppxlib: dune build] [topkg: ocaml build]
- ocamlfind ocamldep -modules src/topkg.ml > src/topkg.ml.depends
- ocamlfind ocamldep -modules src/topkg.mli > src/topkg.mli.depends
- ocamlfind ocamlc -c -g -bin-annot -safe-string -I src -I src-bin -I src-care -I test -o src/topkg.cmi src/topkg.mli
- ocamlfind ocamldep -modules src/topkg_build.ml > src/topkg_build.ml.depends
- ocamlfind ocamldep -modules src/topkg_build.mli > src/topkg_build.mli.depends
- ocamlfind ocamldep -modules src/topkg_cmd.mli > src/topkg_cmd.mli.depends
- ocamlfind ocamldep -modules src/topkg_fpath.mli > src/topkg_fpath.mli.depends
- ocamlfind ocamlc -c -g -bin-annot -safe-string -I src -I src-bin -I src-care -I test -o src/topkg_fpath.cmi src/topkg_fpath.mli
- ocamlfind ocamldep -modules src/topkg_codec.mli > src/topkg_codec.mli.depends
- ocamlfind ocamlc -c -g -bin-annot -safe-string -I src -I src-bin -I src-care -I test -o src/topkg_cmd.cmi src/topkg_cmd.mli
- ocamlfind ocamldep -modules src/topkg_result.mli > src/topkg_result.mli.depends
- ocamlfind ocamlc -c -g -bin-annot -safe-string -I src -I src-bin -I src-care -I test -o src/topkg_result.cmi src/topkg_result.mli
- ocamlfind ocamldep -modules src/topkg_conf.mli > src/topkg_conf.mli.depends
- ocamlfind ocamlc -c -g -bin-annot -safe-string -I src -I src-bin -I src-care -I test -o src/topkg_codec.cmi src/topkg_codec.mli
- ocamlfind ocamlc -c -g -bin-annot -safe-string -I src -I src-bin -I src-care -I test -o src/topkg_conf.cmi src/topkg_conf.mli
- ocamlfind ocamlc -c -g -bin-annot -safe-string -I src -I src-bin -I src-care -I test -o src/topkg_build.cmi src/topkg_build.mli
- ocamlfind ocamldep -modules src/topkg_cmd.ml > src/topkg_cmd.ml.depends
- ocamlfind ocamldep -modules src/topkg_fpath.ml > src/topkg_fpath.ml.depends
- ocamlfind ocamldep -modules src/topkg_string.ml > src/topkg_string.ml.depends
- ocamlfind ocamldep -modules src/topkg_string.mli > src/topkg_string.mli.depends
- ocamlfind ocamlc -c -g -bin-annot -safe-string -I src -I src-bin -I src-care -I test -o src/topkg_string.cmi src/topkg_string.mli
- ocamlfind ocamlopt -c -g -bin-annot -safe-string -I src -I src-bin -I src-care -I test -o src/topkg_string.cmx src/topkg_string.ml
- ocamlfind ocamlopt -c -g -bin-annot -safe-string -I src -I src-bin -I src-care -I test -o src/topkg_fpath.cmx src/topkg_fpath.ml
- ocamlfind ocamldep -modules src/topkg_codec.ml > src/topkg_codec.ml.depends
- ocamlfind ocamlopt -c -g -bin-annot -safe-string -I src -I src-bin -I src-care -I test -o src/topkg_cmd.cmx src/topkg_cmd.ml
- ocamlfind ocamldep -modules src/topkg_os.ml > src/topkg_os.ml.depends
- ocamlfind ocamldep -modules src/topkg_os.mli > src/topkg_os.mli.depends
- ocamlfind ocamlc -c -g -bin-annot -safe-string -I src -I src-bin -I src-care -I test -o src/topkg_os.cmi src/topkg_os.mli
- ocamlfind ocamldep -modules src/topkg_log.ml > src/topkg_log.ml.depends
- ocamlfind ocamldep -modules src/topkg_log.mli > src/topkg_log.mli.depends
- ocamlfind ocamlc -c -g -bin-annot -safe-string -I src -I src-bin -I src-care -I test -o src/topkg_log.cmi src/topkg_log.mli
- ocamlfind ocamldep -modules src/topkg_result.ml > src/topkg_result.ml.depends
- ocamlfind ocamlopt -c -g -bin-annot -safe-string -I src -I src-bin -I src-care -I test -o src/topkg_result.cmx src/topkg_result.ml
- ocamlfind ocamlopt -c -g -bin-annot -safe-string -I src -I src-bin -I src-care -I test -o src/topkg_log.cmx src/topkg_log.ml
- ocamlfind ocamlopt -c -g -bin-annot -safe-string -I src -I src-bin -I src-care -I test -o src/topkg_os.cmx src/topkg_os.ml
- ocamlfind ocamldep -modules src/topkg_conf.ml > src/topkg_conf.ml.depends
- ocamlfind ocamlopt -c -g -bin-annot -safe-string -I src -I src-bin -I src-care -I test -o src/topkg_codec.cmx src/topkg_codec.ml
- ocamlfind ocamldep -modules src/topkg_vcs.ml > src/topkg_vcs.ml.depends
- ocamlfind ocamldep -modules src/topkg_vcs.mli > src/topkg_vcs.mli.depends
- ocamlfind ocamlc -c -g -bin-annot -safe-string -I src -I src-bin -I src-care -I test -o src/topkg_vcs.cmi src/topkg_vcs.mli
- ocamlfind ocamlopt -c -g -bin-annot -safe-string -I src -I src-bin -I src-care -I test -o src/topkg_vcs.cmx src/topkg_vcs.ml
- ocamlfind ocamlopt -c -g -bin-annot -safe-string -I src -I src-bin -I src-care -I test -o src/topkg_conf.cmx src/topkg_conf.ml
- ocamlfind ocamldep -modules src/topkg_distrib.ml > src/topkg_distrib.ml.depends
- ocamlfind ocamldep -modules src/topkg_distrib.mli > src/topkg_distrib.mli.depends
- ocamlfind ocamlc -c -g -bin-annot -safe-string -I src -I src-bin -I src-care -I test -o src/topkg_distrib.cmi src/topkg_distrib.mli
- ocamlfind ocamldep -modules src/topkg_opam.ml > src/topkg_opam.ml.depends
- ocamlfind ocamldep -modules src/topkg_opam.mli > src/topkg_opam.mli.depends
- ocamlfind ocamlc -c -g -bin-annot -safe-string -I src -I src-bin -I src-care -I test -o src/topkg_opam.cmi src/topkg_opam.mli
- ocamlfind ocamlopt -c -g -bin-annot -safe-string -I src -I src-bin -I src-care -I test -o src/topkg_opam.cmx src/topkg_opam.ml
- ocamlfind ocamldep -modules src/topkg_fexts.ml > src/topkg_fexts.ml.depends
- ocamlfind ocamldep -modules src/topkg_fexts.mli > src/topkg_fexts.mli.depends
- ocamlfind ocamlc -c -g -bin-annot -safe-string -I src -I src-bin -I src-care -I test -o src/topkg_fexts.cmi src/topkg_fexts.mli
- ocamlfind ocamldep -modules src/topkg_install.ml > src/topkg_install.ml.depends
- ocamlfind ocamldep -modules src/topkg_install.mli > src/topkg_install.mli.depends
- ocamlfind ocamldep -modules src/topkg_test.mli > src/topkg_test.mli.depends
- ocamlfind ocamlc -c -g -bin-annot -safe-string -I src -I src-bin -I src-care -I test -o src/topkg_test.cmi src/topkg_test.mli
- ocamlfind ocamlc -c -g -bin-annot -safe-string -I src -I src-bin -I src-care -I test -o src/topkg_install.cmi src/topkg_install.mli
- ocamlfind ocamlopt -c -g -bin-annot -safe-string -I src -I src-bin -I src-care -I test -o src/topkg_fexts.cmx src/topkg_fexts.ml
- ocamlfind ocamldep -modules src/topkg_test.ml > src/topkg_test.ml.depends
- ocamlfind ocamlopt -c -g -bin-annot -safe-string -I src -I src-bin -I src-care -I test -o src/topkg_test.cmx src/topkg_test.ml
- ocamlfind ocamldep -modules src/topkg_ipc.ml > src/topkg_ipc.ml.depends
- ocamlfind ocamldep -modules src/topkg_ipc.mli > src/topkg_ipc.mli.depends
- ocamlfind ocamldep -modules src/topkg_pkg.mli > src/topkg_pkg.mli.depends
- ocamlfind ocamldep -modules src/topkg_publish.mli > src/topkg_publish.mli.depends
- ocamlfind ocamlc -c -g -bin-annot -safe-string -I src -I src-bin -I src-care -I test -o src/topkg_publish.cmi src/topkg_publish.mli
- ocamlfind ocamlc -c -g -bin-annot -safe-string -I src -I src-bin -I src-care -I test -o src/topkg_pkg.cmi src/topkg_pkg.mli
- ocamlfind ocamlc -c -g -bin-annot -safe-string -I src -I src-bin -I src-care -I test -o src/topkg_ipc.cmi src/topkg_ipc.mli
- ocamlfind ocamldep -modules src/topkg_pkg.ml > src/topkg_pkg.ml.depends
- ocamlfind ocamlopt -c -g -bin-annot -safe-string -I src -I src-bin -I src-care -I test -o src/topkg_build.cmx src/topkg_build.ml
- ocamlfind ocamlopt -c -g -bin-annot -safe-string -I src -I src-bin -I src-care -I test -o src/topkg_distrib.cmx src/topkg_distrib.ml
- ocamlfind ocamlopt -c -g -bin-annot -safe-string -I src -I src-bin -I src-care -I test -o src/topkg_install.cmx src/topkg_install.ml
- ocamlfind ocamldep -modules src/topkg_publish.ml > src/topkg_publish.ml.depends
- ocamlfind ocamlopt -c -g -bin-annot -safe-string -I src -I src-bin -I src-care -I test -o src/topkg_publish.cmx src/topkg_publish.ml
- ocamlfind ocamlopt -c -g -bin-annot -safe-string -I src -I src-bin -I src-care -I test -o src/topkg_pkg.cmx src/topkg_pkg.ml
- ocamlfind ocamldep -modules src/topkg_main.ml > src/topkg_main.ml.depends
- ocamlfind ocamldep -modules src/topkg_main.mli > src/topkg_main.mli.depends
- ocamlfind ocamlc -c -g -bin-annot -safe-string -I src -I src-bin -I src-care -I test -o src/topkg_main.cmi src/topkg_main.mli
- ocamlfind ocamlopt -c -g -bin-annot -safe-string -I src -I src-bin -I src-care -I test -o src/topkg_ipc.cmx src/topkg_ipc.ml
- ocamlfind ocamlopt -c -g -bin-annot -safe-string -I src -I src-bin -I src-care -I test -o src/topkg_main.cmx src/topkg_main.ml
- ocamlfind ocamlopt -c -g -bin-annot -safe-string -I src -I src-bin -I src-care -I test -o src/topkg.cmx src/topkg.ml
- ocamlfind ocamlopt -a -I src src/topkg_string.cmx src/topkg_fpath.cmx src/topkg_cmd.cmx src/topkg_result.cmx src/topkg_log.cmx src/topkg_os.cmx src/topkg_codec.cmx src/topkg_vcs.cmx src/topkg_conf.cmx src/topkg_build.cmx src/topkg_opam.cmx src/topkg_distrib.cmx src/topkg_fexts.cmx src/topkg_test.cmx src/topkg_install.cmx src/topkg_publish.cmx src/topkg_pkg.cmx src/topkg_ipc.cmx src/topkg_main.cmx src/topkg.cmx -o src/topkg.cmxa
- ocamlfind ocamlopt -shared -linkall -I src src/topkg.cmxa -o src/topkg.cmxs
- ocamlfind ocamlc -c -g -bin-annot -safe-string -I src -I src-bin -I src-care -I test -o src/topkg.cmo src/topkg.ml
- ocamlfind ocamlc -c -g -bin-annot -safe-string -I src -I src-bin -I src-care -I test -o src/topkg_build.cmo src/topkg_build.ml
- ocamlfind ocamlc -c -g -bin-annot -safe-string -I src -I src-bin -I src-care -I test -o src/topkg_cmd.cmo src/topkg_cmd.ml
- ocamlfind ocamlc -c -g -bin-annot -safe-string -I src -I src-bin -I src-care -I test -o src/topkg_codec.cmo src/topkg_codec.ml
- ocamlfind ocamlc -c -g -bin-annot -safe-string -I src -I src-bin -I src-care -I test -o src/topkg_conf.cmo src/topkg_conf.ml
- ocamlfind ocamlc -c -g -bin-annot -safe-string -I src -I src-bin -I src-care -I test -o src/topkg_distrib.cmo src/topkg_distrib.ml
- ocamlfind ocamlc -c -g -bin-annot -safe-string -I src -I src-bin -I src-care -I test -o src/topkg_fexts.cmo src/topkg_fexts.ml
- ocamlfind ocamlc -c -g -bin-annot -safe-string -I src -I src-bin -I src-care -I test -o src/topkg_fpath.cmo src/topkg_fpath.ml
- ocamlfind ocamlc -c -g -bin-annot -safe-string -I src -I src-bin -I src-care -I test -o src/topkg_install.cmo src/topkg_install.ml
- ocamlfind ocamlc -c -g -bin-annot -safe-string -I src -I src-bin -I src-care -I test -o src/topkg_ipc.cmo src/topkg_ipc.ml
- ocamlfind ocamlc -c -g -bin-annot -safe-string -I src -I src-bin -I src-care -I test -o src/topkg_log.cmo src/topkg_log.ml
- ocamlfind ocamlc -c -g -bin-annot -safe-string -I src -I src-bin -I src-care -I test -o src/topkg_main.cmo src/topkg_main.ml
- ocamlfind ocamlc -c -g -bin-annot -safe-string -I src -I src-bin -I src-care -I test -o src/topkg_opam.cmo src/topkg_opam.ml
- ocamlfind ocamlc -c -g -bin-annot -safe-string -I src -I src-bin -I src-care -I test -o src/topkg_os.cmo src/topkg_os.ml
- ocamlfind ocamlc -c -g -bin-annot -safe-string -I src -I src-bin -I src-care -I test -o src/topkg_pkg.cmo src/topkg_pkg.ml
- ocamlfind ocamlc -c -g -bin-annot -safe-string -I src -I src-bin -I src-care -I test -o src/topkg_publish.cmo src/topkg_publish.ml
- ocamlfind ocamlc -c -g -bin-annot -safe-string -I src -I src-bin -I src-care -I test -o src/topkg_result.cmo src/topkg_result.ml
- ocamlfind ocamlc -c -g -bin-annot -safe-string -I src -I src-bin -I src-care -I test -o src/topkg_string.cmo src/topkg_string.ml
- ocamlfind ocamlc -c -g -bin-annot -safe-string -I src -I src-bin -I src-care -I test -o src/topkg_test.cmo src/topkg_test.ml
- ocamlfind ocamlc -c -g -bin-annot -safe-string -I src -I src-bin -I src-care -I test -o src/topkg_vcs.cmo src/topkg_vcs.ml
- ocamlfind ocamlc -a -I src src/topkg_string.cmo src/topkg_fpath.cmo src/topkg_cmd.cmo src/topkg_result.cmo src/topkg_log.cmo src/topkg_os.cmo src/topkg_codec.cmo src/topkg_vcs.cmo src/topkg_conf.cmo src/topkg_build.cmo src/topkg_opam.cmo src/topkg_distrib.cmo src/topkg_fexts.cmo src/topkg_test.cmo src/topkg_install.cmo src/topkg_publish.cmo src/topkg_pkg.cmo src/topkg_ipc.cmo src/topkg_main.cmo src/topkg.cmo -o src/topkg.cma
- # Parallel statistics: { count(total): 2(84), max: 20, min: 2, average(total): 11.000(1.238) }
-> compiled  topkg.1.0.7
Processing 101/150: [cstruct: dune build] [ppxlib: dune build]
-> installed topkg.1.0.7
Processing 102/150: [cstruct: dune build] [ppxlib: dune build]
Processing 103/150: [asetmap: ocaml build] [cstruct: dune build] [ppxlib: dune build]
Processing 104/150: [asetmap: ocaml build] [astring: ocaml build] [cstruct: dune build] [ppxlib: dune build]
Processing 105/150: [asetmap: ocaml build] [astring: ocaml build] [cstruct: dune build] [fmt: ocaml build] [ppxlib: dune build]
Processing 106/150: [asetmap: ocaml build] [astring: ocaml build] [cstruct: dune build] [fmt: ocaml build] [ppxlib: dune build] [rresult: ocaml build]
-       ocamlc lib/cstruct_stubs.o
- cstruct_stubs.c: In function 'caml_blit_bigstring_to_string':
- cstruct_stubs.c:29:31: warning: passing argument 1 of 'memcpy' discards 'const' qualifier from pointer target type [-Wdiscarded-qualifiers]
-    29 |   memcpy(String_val(val_buf2) + Long_val(val_ofs2),
- In file included from cstruct_stubs.c:18:
- /usr/include/string.h:43:39: note: expected 'void * restrict' but argument is of type 'const char *'
-    43 | extern void *memcpy (void *__restrict __dest, const void *__restrict __src,
-       |                      ~~~~~~~~~~~~~~~~~^~~~~~
-> compiled  cstruct.3.7.0
Processing 106/150: [asetmap: ocaml build] [astring: ocaml build] [fmt: ocaml build] [ppxlib: dune build] [rresult: ocaml build]
-> installed cstruct.3.7.0
Processing 107/150: [asetmap: ocaml build] [astring: ocaml build] [fmt: ocaml build] [ppxlib: dune build] [rresult: ocaml build]
Processing 108/150: [asetmap: ocaml build] [astring: ocaml build] [cstruct-lwt: dune build] [fmt: ocaml build] [ppxlib: dune build] [rresult: ocaml build]
Processing 109/150: [asetmap: ocaml build] [astring: ocaml build] [cstruct-lwt: dune build] [fmt: ocaml build] [io-page: dune build] [ppxlib: dune build] [rresult: ocaml build]
- ocamlfind ocamldep -package bytes -modules src/asetmap.ml > src/asetmap.ml.depends
- ocamlfind ocamldep -package bytes -modules src/asetmap.mli > src/asetmap.mli.depends
- ocamlfind ocamlc -c -g -bin-annot -safe-string -package bytes -I src -I test -o src/asetmap.cmi src/asetmap.mli
- ocamlfind ocamlopt -c -g -bin-annot -safe-string -package bytes -I src -I test -o src/asetmap.cmx src/asetmap.ml
- ocamlfind ocamlopt -a -package bytes -I src src/asetmap.cmx -o src/asetmap.cmxa
- ocamlfind ocamlopt -shared -linkall -package bytes -I src src/asetmap.cmxa -o src/asetmap.cmxs
- ocamlfind ocamlc -c -g -bin-annot -safe-string -package bytes -I src -I test -o src/asetmap.cmo src/asetmap.ml
- ocamlfind ocamlc -a -package bytes -I src src/asetmap.cmo -o src/asetmap.cma
- # No parallelism done
-> compiled  asetmap.0.8.1
Processing 109/150: [astring: ocaml build] [cstruct-lwt: dune build] [fmt: ocaml build] [io-page: dune build] [ppxlib: dune build] [rresult: ocaml build]
-> installed asetmap.0.8.1
Processing 110/150: [astring: ocaml build] [cstruct-lwt: dune build] [fmt: ocaml build] [io-page: dune build] [ppxlib: dune build] [rresult: ocaml build]
-> compiled  cstruct-lwt.3.7.0
Processing 110/150: [astring: ocaml build] [fmt: ocaml build] [io-page: dune build] [ppxlib: dune build] [rresult: ocaml build]
-> installed cstruct-lwt.3.7.0
Processing 111/150: [astring: ocaml build] [fmt: ocaml build] [io-page: dune build] [ppxlib: dune build] [rresult: ocaml build]
-> compiled  io-page.2.3.0
Processing 111/150: [astring: ocaml build] [fmt: ocaml build] [ppxlib: dune build] [rresult: ocaml build]
-> installed io-page.2.3.0
Processing 112/150: [astring: ocaml build] [fmt: ocaml build] [ppxlib: dune build] [rresult: ocaml build]
Processing 113/150: [astring: ocaml build] [fmt: ocaml build] [io-page-unix: dune build] [ppxlib: dune build] [rresult: ocaml build]
- ocamlfind ocamldep -modules src/rresult.ml > src/rresult.ml.depends
- ocamlfind ocamldep -modules src/rresult.mli > src/rresult.mli.depends
- ocamlfind ocamlc -c -g -bin-annot -safe-string -I src -I test -o src/rresult.cmi src/rresult.mli
- ocamlfind ocamlopt -c -g -bin-annot -safe-string -I src -I test -o src/rresult.cmx src/rresult.ml
- ocamlfind ocamlopt -a -I src src/rresult.cmx -o src/rresult.cmxa
- ocamlfind ocamlopt -shared -linkall -I src src/rresult.cmxa -o src/rresult.cmxs
- ocamlfind ocamlc -c -g -bin-annot -safe-string -I src -I test -o src/rresult.cmo src/rresult.ml
- ocamlfind ocamlc -a -I src src/rresult.cmo -o src/rresult.cma
- ocamlfind ocamldep -package compiler-libs.toplevel -modules src/rresult_top.ml > src/rresult_top.ml.depends
- ocamlfind ocamlc -c -g -bin-annot -safe-string -package compiler-libs.toplevel -I src -I test -o src/rresult_top.cmo src/rresult_top.ml
- + ocamlfind ocamlc -c -g -bin-annot -safe-string -package compiler-libs.toplevel -I src -I test -o src/rresult_top.cmo src/rresult_top.ml
- findlib: [WARNING] Interface topdirs.cmi occurs in several directories: /home/opam/.opam/4.11/lib/ocaml, /home/opam/.opam/4.11/lib/ocaml/compiler-libs
- ocamlfind ocamlopt -c -g -bin-annot -safe-string -package compiler-libs.toplevel -I src -I test -o src/rresult_top.cmx src/rresult_top.ml
- + ocamlfind ocamlopt -c -g -bin-annot -safe-string -package compiler-libs.toplevel -I src -I test -o src/rresult_top.cmx src/rresult_top.ml
- findlib: [WARNING] Interface topdirs.cmi occurs in several directories: /home/opam/.opam/4.11/lib/ocaml, /home/opam/.opam/4.11/lib/ocaml/compiler-libs
- File "_none_", line 1:
- Warning 58: no cmx file was found in path for module Toploop, and its interface was not compiled with -opaque
- ocamlfind ocamlopt -a -package compiler-libs.toplevel -I src src/rresult_top.cmx -o src/rresult_top.cmxa
- + ocamlfind ocamlopt -a -package compiler-libs.toplevel -I src src/rresult_top.cmx -o src/rresult_top.cmxa
- findlib: [WARNING] Interface topdirs.cmi occurs in several directories: /home/opam/.opam/4.11/lib/ocaml, /home/opam/.opam/4.11/lib/ocaml/compiler-libs
- ocamlfind ocamlopt -shared -linkall -package compiler-libs.toplevel -I src src/rresult_top.cmxa -o src/rresult_top.cmxs
- + ocamlfind ocamlopt -shared -linkall -package compiler-libs.toplevel -I src src/rresult_top.cmxa -o src/rresult_top.cmxs
- findlib: [WARNING] Interface topdirs.cmi occurs in several directories: /home/opam/.opam/4.11/lib/ocaml, /home/opam/.opam/4.11/lib/ocaml/compiler-libs
- ocamlfind ocamlc -a -package compiler-libs.toplevel -I src src/rresult_top.cmo -o src/rresult_top.cma
- + ocamlfind ocamlc -a -package compiler-libs.toplevel -I src src/rresult_top.cmo -o src/rresult_top.cma
- findlib: [WARNING] Interface topdirs.cmi occurs in several directories: /home/opam/.opam/4.11/lib/ocaml, /home/opam/.opam/4.11/lib/ocaml/compiler-libs
- # No parallelism done
-> compiled  rresult.0.7.0
Processing 113/150: [astring: ocaml build] [fmt: ocaml build] [io-page-unix: dune build] [ppxlib: dune build]
-> installed rresult.0.7.0
Processing 114/150: [astring: ocaml build] [fmt: ocaml build] [io-page-unix: dune build] [ppxlib: dune build]
-> compiled  io-page-unix.2.3.0
Processing 114/150: [astring: ocaml build] [fmt: ocaml build] [ppxlib: dune build]
-> installed io-page-unix.2.3.0
Processing 115/150: [astring: ocaml build] [fmt: ocaml build] [ppxlib: dune build]
- ocamlfind ocamldep -modules src/fmt.ml > src/fmt.ml.depends
- ocamlfind ocamldep -modules src/fmt.mli > src/fmt.mli.depends
- ocamlfind ocamlc -c -g -bin-annot -safe-string -I src -I test -o src/fmt.cmi src/fmt.mli
- ocamlfind ocamlopt -c -g -bin-annot -safe-string -I src -I test -o src/fmt.cmx src/fmt.ml
- ocamlfind ocamlopt -a -I src src/fmt.cmx -o src/fmt.cmxa
- ocamlfind ocamlopt -shared -linkall -I src src/fmt.cmxa -o src/fmt.cmxs
- ocamlfind ocamlc -c -g -bin-annot -safe-string -I src -I test -o src/fmt.cmo src/fmt.ml
- ocamlfind ocamlc -a -I src src/fmt.cmo -o src/fmt.cma
- ocamlfind ocamldep -package unix -modules src/fmt_tty.ml > src/fmt_tty.ml.depends
- ocamlfind ocamldep -package unix -modules src/fmt_tty.mli > src/fmt_tty.mli.depends
- ocamlfind ocamlc -c -g -bin-annot -safe-string -package unix -I src -I test -o src/fmt_tty.cmi src/fmt_tty.mli
- ocamlfind ocamlopt -c -g -bin-annot -safe-string -package unix -I src -I test -o src/fmt_tty.cmx src/fmt_tty.ml
- ocamlfind ocamlopt -a -package unix -I src src/fmt_tty.cmx -o src/fmt_tty.cmxa
- ocamlfind ocamlopt -shared -linkall -package unix -I src src/fmt_tty.cmxa -o src/fmt_tty.cmxs
- ocamlfind ocamlc -c -g -bin-annot -safe-string -package unix -I src -I test -o src/fmt_tty.cmo src/fmt_tty.ml
- ocamlfind ocamlc -a -package unix -I src src/fmt_tty.cmo -o src/fmt_tty.cma
- ocamlfind ocamldep -package cmdliner -modules src/fmt_cli.ml > src/fmt_cli.ml.depends
- ocamlfind ocamldep -package cmdliner -modules src/fmt_cli.mli > src/fmt_cli.mli.depends
- ocamlfind ocamlc -c -g -bin-annot -safe-string -package cmdliner -I src -I test -o src/fmt_cli.cmi src/fmt_cli.mli
- + ocamlfind ocamlc -c -g -bin-annot -safe-string -package cmdliner -I src -I test -o src/fmt_cli.cmi src/fmt_cli.mli
- File "src/fmt_cli.mli", line 10, characters 26-42:
- 10 | val style_renderer : ?env:Cmdliner.Arg.env -> ?docs:string -> unit ->
-                                ^^^^^^^^^^^^^^^^
- Alert deprecated: Cmdliner.Arg.env
- Use Cmd.Env.info instead.
- ocamlfind ocamlopt -c -g -bin-annot -safe-string -package cmdliner -I src -I test -o src/fmt_cli.cmx src/fmt_cli.ml
- ocamlfind ocamlopt -a -package cmdliner -I src src/fmt_cli.cmx -o src/fmt_cli.cmxa
- ocamlfind ocamlopt -shared -linkall -package cmdliner -I src src/fmt_cli.cmxa -o src/fmt_cli.cmxs
- ocamlfind ocamlc -c -g -bin-annot -safe-string -package cmdliner -I src -I test -o src/fmt_cli.cmo src/fmt_cli.ml
- ocamlfind ocamlc -a -package cmdliner -I src src/fmt_cli.cmo -o src/fmt_cli.cma
- ocamlfind ocamldep -package compiler-libs.toplevel -modules src/fmt_top.ml > src/fmt_top.ml.depends
- ocamlfind ocamlc -c -g -bin-annot -safe-string -package compiler-libs.toplevel -I src -I test -o src/fmt_top.cmo src/fmt_top.ml
- + ocamlfind ocamlc -c -g -bin-annot -safe-string -package compiler-libs.toplevel -I src -I test -o src/fmt_top.cmo src/fmt_top.ml
- findlib: [WARNING] Interface topdirs.cmi occurs in several directories: /home/opam/.opam/4.11/lib/ocaml, /home/opam/.opam/4.11/lib/ocaml/compiler-libs
- ocamlfind ocamlopt -c -g -bin-annot -safe-string -package compiler-libs.toplevel -I src -I test -o src/fmt_top.cmx src/fmt_top.ml
- + ocamlfind ocamlopt -c -g -bin-annot -safe-string -package compiler-libs.toplevel -I src -I test -o src/fmt_top.cmx src/fmt_top.ml
- findlib: [WARNING] Interface topdirs.cmi occurs in several directories: /home/opam/.opam/4.11/lib/ocaml, /home/opam/.opam/4.11/lib/ocaml/compiler-libs
- File "_none_", line 1:
- Warning 58: no cmx file was found in path for module Toploop, and its interface was not compiled with -opaque
- ocamlfind ocamlopt -a -package compiler-libs.toplevel -I src src/fmt_top.cmx -o src/fmt_top.cmxa
- + ocamlfind ocamlopt -a -package compiler-libs.toplevel -I src src/fmt_top.cmx -o src/fmt_top.cmxa
- findlib: [WARNING] Interface topdirs.cmi occurs in several directories: /home/opam/.opam/4.11/lib/ocaml, /home/opam/.opam/4.11/lib/ocaml/compiler-libs
- ocamlfind ocamlopt -shared -linkall -package compiler-libs.toplevel -I src src/fmt_top.cmxa -o src/fmt_top.cmxs
- + ocamlfind ocamlopt -shared -linkall -package compiler-libs.toplevel -I src src/fmt_top.cmxa -o src/fmt_top.cmxs
- findlib: [WARNING] Interface topdirs.cmi occurs in several directories: /home/opam/.opam/4.11/lib/ocaml, /home/opam/.opam/4.11/lib/ocaml/compiler-libs
- ocamlfind ocamlc -a -package compiler-libs.toplevel -I src src/fmt_top.cmo -o src/fmt_top.cma
- + ocamlfind ocamlc -a -package compiler-libs.toplevel -I src src/fmt_top.cmo -o src/fmt_top.cma
- findlib: [WARNING] Interface topdirs.cmi occurs in several directories: /home/opam/.opam/4.11/lib/ocaml, /home/opam/.opam/4.11/lib/ocaml/compiler-libs
- # No parallelism done
-> compiled  fmt.0.9.0
Processing 115/150: [astring: ocaml build] [ppxlib: dune build]
-> installed fmt.0.9.0
Processing 116/150: [astring: ocaml build] [ppxlib: dune build]
Processing 117/150: [astring: ocaml build] [logs: ocaml build] [ppxlib: dune build]
Processing 118/150: [astring: ocaml build] [logs: ocaml build] [mirage-device: dune build] [ppxlib: dune build]
Processing 119/150: [astring: ocaml build] [logs: ocaml build] [mirage-device: dune build] [mirage-flow: dune build] [ppxlib: dune build]
-> compiled  mirage-device.1.2.0
Processing 119/150: [astring: ocaml build] [logs: ocaml build] [mirage-flow: dune build] [ppxlib: dune build]
-> installed mirage-device.1.2.0
Processing 120/150: [astring: ocaml build] [logs: ocaml build] [mirage-flow: dune build] [ppxlib: dune build]
Processing 121/150: [astring: ocaml build] [logs: ocaml build] [mirage-clock: dune build] [mirage-flow: dune build] [ppxlib: dune build]
Processing 122/150: [astring: ocaml build] [logs: ocaml build] [mirage-clock: dune build] [mirage-flow: dune build] [mirage-kv: jbuilder build] [ppxlib: dune build]
-       ocamlc src/.mirage_flow.objs/byte/mirage_flow.{cmo,cmt}
- File "src/mirage_flow.ml", line 71, characters 30-38:
- 71 |     | Error e -> Error (`Msg (Fmt.strf "%a" S.pp_error e))
-                                    ^^^^^^^^
- Alert deprecated: Fmt.strf
- use Fmt.str instead.
- File "src/mirage_flow.ml", line 76, characters 36-44:
- 76 |     | Error e       -> Error (`Msg (Fmt.strf "%a" S.pp_write_error e))
-                                          ^^^^^^^^
- Alert deprecated: Fmt.strf
- use Fmt.str instead.
-     ocamlopt src/.mirage_flow.objs/native/mirage_flow.{cmx,o}
- File "src/mirage_flow.ml", line 71, characters 30-38:
- 71 |     | Error e -> Error (`Msg (Fmt.strf "%a" S.pp_error e))
-                                    ^^^^^^^^
- Alert deprecated: Fmt.strf
- use Fmt.str instead.
- File "src/mirage_flow.ml", line 76, characters 36-44:
- 76 |     | Error e       -> Error (`Msg (Fmt.strf "%a" S.pp_write_error e))
-                                          ^^^^^^^^
- Alert deprecated: Fmt.strf
- use Fmt.str instead.
-> compiled  mirage-flow.1.6.0
Processing 122/150: [astring: ocaml build] [logs: ocaml build] [mirage-clock: dune build] [mirage-kv: jbuilder build] [ppxlib: dune build]
-> installed mirage-flow.1.6.0
Processing 123/150: [astring: ocaml build] [logs: ocaml build] [mirage-clock: dune build] [mirage-kv: jbuilder build] [ppxlib: dune build]
Processing 124/150: [astring: ocaml build] [logs: ocaml build] [mirage-channel: dune build] [mirage-clock: dune build] [mirage-kv: jbuilder build] [ppxlib: dune build]
- ocamlfind ocamldep -modules src/astring_unsafe.ml > src/astring_unsafe.ml.depends
- ocamlfind ocamlc -c -g -bin-annot -safe-string -I src -I test -o src/astring_unsafe.cmo src/astring_unsafe.ml
- ocamlfind ocamldep -modules src/astring_base.ml > src/astring_base.ml.depends
- ocamlfind ocamlc -c -g -bin-annot -safe-string -I src -I test -o src/astring_base.cmo src/astring_base.ml
- ocamlfind ocamlopt -c -g -bin-annot -safe-string -I src -I test -o src/astring_unsafe.cmx src/astring_unsafe.ml
- ocamlfind ocamldep -modules src/astring_escape.ml > src/astring_escape.ml.depends
- ocamlfind ocamlc -c -g -bin-annot -safe-string -I src -I test -o src/astring_escape.cmo src/astring_escape.ml
- ocamlfind ocamldep -modules src/astring_char.ml > src/astring_char.ml.depends
- ocamlfind ocamlc -c -g -bin-annot -safe-string -I src -I test -o src/astring_char.cmo src/astring_char.ml
- ocamlfind ocamlopt -c -g -bin-annot -safe-string -I src -I test -o src/astring_escape.cmx src/astring_escape.ml
- ocamlfind ocamldep -modules src/astring_sub.ml > src/astring_sub.ml.depends
- ocamlfind ocamlc -c -g -bin-annot -safe-string -I src -I test -o src/astring_sub.cmo src/astring_sub.ml
- ocamlfind ocamlopt -c -g -bin-annot -safe-string -I src -I test -o src/astring_base.cmx src/astring_base.ml
- ocamlfind ocamlopt -c -g -bin-annot -safe-string -I src -I test -o src/astring_char.cmx src/astring_char.ml
- ocamlfind ocamldep -modules src/astring_string.ml > src/astring_string.ml.depends
- ocamlfind ocamlc -c -g -bin-annot -safe-string -I src -I test -o src/astring_string.cmo src/astring_string.ml
- ocamlfind ocamlopt -c -g -bin-annot -safe-string -I src -I test -o src/astring_sub.cmx src/astring_sub.ml
- ocamlfind ocamldep -modules src/astring.ml > src/astring.ml.depends
- ocamlfind ocamldep -modules src/astring.mli > src/astring.mli.depends
- ocamlfind ocamlc -c -g -bin-annot -safe-string -I src -I test -o src/astring.cmi src/astring.mli
- ocamlfind ocamlopt -c -g -bin-annot -safe-string -I src -I test -o src/astring_string.cmx src/astring_string.ml
- ocamlfind ocamlopt -c -g -bin-annot -safe-string -I src -I test -o src/astring.cmx src/astring.ml
- ocamlfind ocamlopt -a -I src src/astring_unsafe.cmx src/astring_base.cmx src/astring_escape.cmx src/astring_char.cmx src/astring_sub.cmx src/astring_string.cmx src/astring.cmx -o src/astring.cmxa
- ocamlfind ocamlopt -shared -linkall -I src src/astring.cmxa -o src/astring.cmxs
- ocamlfind ocamlc -c -g -bin-annot -safe-string -I src -I test -o src/astring.cmo src/astring.ml
- ocamlfind ocamlc -a -I src src/astring_unsafe.cmo src/astring_base.cmo src/astring_escape.cmo src/astring_char.cmo src/astring_sub.cmo src/astring_string.cmo src/astring.cmo -o src/astring.cma
- ocamlfind ocamldep -package compiler-libs.toplevel -modules src/astring_top.ml > src/astring_top.ml.depends
- ocamlfind ocamlc -c -g -bin-annot -safe-string -package compiler-libs.toplevel -I src -I test -o src/astring_top.cmo src/astring_top.ml
- + ocamlfind ocamlc -c -g -bin-annot -safe-string -package compiler-libs.toplevel -I src -I test -o src/astring_top.cmo src/astring_top.ml
- findlib: [WARNING] Interface topdirs.cmi occurs in several directories: /home/opam/.opam/4.11/lib/ocaml, /home/opam/.opam/4.11/lib/ocaml/compiler-libs
- ocamlfind ocamlopt -c -g -bin-annot -safe-string -package compiler-libs.toplevel -I src -I test -o src/astring_top.cmx src/astring_top.ml
- + ocamlfind ocamlopt -c -g -bin-annot -safe-string -package compiler-libs.toplevel -I src -I test -o src/astring_top.cmx src/astring_top.ml
- findlib: [WARNING] Interface topdirs.cmi occurs in several directories: /home/opam/.opam/4.11/lib/ocaml, /home/opam/.opam/4.11/lib/ocaml/compiler-libs
- File "_none_", line 1:
- Warning 58: no cmx file was found in path for module Toploop, and its interface was not compiled with -opaque
- ocamlfind ocamlopt -a -package compiler-libs.toplevel -I src src/astring_top.cmx -o src/astring_top.cmxa
- + ocamlfind ocamlopt -a -package compiler-libs.toplevel -I src src/astring_top.cmx -o src/astring_top.cmxa
- findlib: [WARNING] Interface topdirs.cmi occurs in several directories: /home/opam/.opam/4.11/lib/ocaml, /home/opam/.opam/4.11/lib/ocaml/compiler-libs
- ocamlfind ocamlopt -shared -linkall -package compiler-libs.toplevel -I src src/astring_top.cmxa -o src/astring_top.cmxs
- + ocamlfind ocamlopt -shared -linkall -package compiler-libs.toplevel -I src src/astring_top.cmxa -o src/astring_top.cmxs
- findlib: [WARNING] Interface topdirs.cmi occurs in several directories: /home/opam/.opam/4.11/lib/ocaml, /home/opam/.opam/4.11/lib/ocaml/compiler-libs
- ocamlfind ocamlc -a -package compiler-libs.toplevel -I src src/astring_top.cmo -o src/astring_top.cma
- + ocamlfind ocamlc -a -package compiler-libs.toplevel -I src src/astring_top.cmo -o src/astring_top.cma
- findlib: [WARNING] Interface topdirs.cmi occurs in several directories: /home/opam/.opam/4.11/lib/ocaml, /home/opam/.opam/4.11/lib/ocaml/compiler-libs
- # No parallelism done
-> compiled  astring.0.8.5
Processing 124/150: [logs: ocaml build] [mirage-channel: dune build] [mirage-clock: dune build] [mirage-kv: jbuilder build] [ppxlib: dune build]
-> installed astring.0.8.5
Processing 125/150: [logs: ocaml build] [mirage-channel: dune build] [mirage-clock: dune build] [mirage-kv: jbuilder build] [ppxlib: dune build]
[ocb-stubblr: patch] applying custom-cclib.patch
Processing 126/150: [logs: ocaml build] [mirage-channel: dune build] [mirage-clock: dune build] [mirage-kv: jbuilder build] [ocb-stubblr: patch] [ppxlib: dune build]
Processing 127/150: [logs: ocaml build] [mirage-channel: dune build] [mirage-clock: dune build] [mirage-kv: jbuilder build] [ocb-stubblr: patch] [ppxlib: dune build] [prometheus: dune build]
[ocb-stubblr: patch] applying use-OPAM_SWITCH_PREFIX.patch
Processing 127/150: [logs: ocaml build] [mirage-channel: dune build] [mirage-clock: dune build] [mirage-kv: jbuilder build] [ocb-stubblr: ocaml build] [ppxlib: dune build] [prometheus: dune build]
-> compiled  mirage-clock.2.0.0
Processing 127/150: [logs: ocaml build] [mirage-channel: dune build] [mirage-kv: jbuilder build] [ocb-stubblr: ocaml build] [ppxlib: dune build] [prometheus: dune build]
-> installed mirage-clock.2.0.0
Processing 128/150: [logs: ocaml build] [mirage-channel: dune build] [mirage-kv: jbuilder build] [ocb-stubblr: ocaml build] [ppxlib: dune build] [prometheus: dune build]
- The jbuilder binary is deprecated and will cease to be maintained in July 2019.
- Please switch to dune instead.
- File "lwt/jbuild", line 1, characters 0-0:
- Warning: jbuild files are deprecated, please convert this file to a dune file
- instead.
- Note: You can use "dune upgrade" to convert your project to dune.
- File "src/jbuild", line 1, characters 0-0:
- Warning: jbuild files are deprecated, please convert this file to a dune file
- instead.
- Note: You can use "dune upgrade" to convert your project to dune.
-> compiled  mirage-kv.1.1.1
Processing 128/150: [logs: ocaml build] [mirage-channel: dune build] [ocb-stubblr: ocaml build] [ppxlib: dune build] [prometheus: dune build]
-> installed mirage-kv.1.1.1
Processing 129/150: [logs: ocaml build] [mirage-channel: dune build] [ocb-stubblr: ocaml build] [ppxlib: dune build] [prometheus: dune build]
Processing 130/150: [logs: ocaml build] [mirage-channel: dune build] [mirage-kv-lwt: jbuilder build] [ocb-stubblr: ocaml build] [ppxlib: dune build] [prometheus: dune build]
-> compiled  mirage-channel.3.2.0
Processing 130/150: [logs: ocaml build] [mirage-kv-lwt: jbuilder build] [ocb-stubblr: ocaml build] [ppxlib: dune build] [prometheus: dune build]
-> installed mirage-channel.3.2.0
Processing 131/150: [logs: ocaml build] [mirage-kv-lwt: jbuilder build] [ocb-stubblr: ocaml build] [ppxlib: dune build] [prometheus: dune build]
-       ocamlc src/.prometheus.objs/byte/prometheus.{cmo,cmt}
- File "src/prometheus.ml", line 20, characters 16-24:
- 20 |       failwith (Fmt.strf "Invalid name %S" name);
-                      ^^^^^^^^
- Alert deprecated: Fmt.strf
- use Fmt.str instead.
- File "src/prometheus.ml", line 111, characters 19-27:
- 111 |     then failwith (Fmt.strf "%a already registered" MetricName.pp info.MetricInfo.name);
-                          ^^^^^^^^
- Alert deprecated: Fmt.strf
- use Fmt.str instead.
-     ocamlopt src/.prometheus.objs/native/prometheus.{cmx,o}
- File "src/prometheus.ml", line 20, characters 16-24:
- 20 |       failwith (Fmt.strf "Invalid name %S" name);
-                      ^^^^^^^^
- Alert deprecated: Fmt.strf
- use Fmt.str instead.
- File "src/prometheus.ml", line 111, characters 19-27:
- 111 |     then failwith (Fmt.strf "%a already registered" MetricName.pp info.MetricInfo.name);
-                          ^^^^^^^^
- Alert deprecated: Fmt.strf
- use Fmt.str instead.
-> compiled  prometheus.1.1
Processing 131/150: [logs: ocaml build] [mirage-kv-lwt: jbuilder build] [ocb-stubblr: ocaml build] [ppxlib: dune build]
-> installed prometheus.1.1
Processing 132/150: [logs: ocaml build] [mirage-kv-lwt: jbuilder build] [ocb-stubblr: ocaml build] [ppxlib: dune build]
- The jbuilder binary is deprecated and will cease to be maintained in July 2019.
- Please switch to dune instead.
- File "lwt/jbuild", line 1, characters 0-0:
- Warning: jbuild files are deprecated, please convert this file to a dune file
- instead.
- Note: You can use "dune upgrade" to convert your project to dune.
- File "src/jbuild", line 1, characters 0-0:
- Warning: jbuild files are deprecated, please convert this file to a dune file
- instead.
- Note: You can use "dune upgrade" to convert your project to dune.
-> compiled  mirage-kv-lwt.1.1.0
Processing 132/150: [logs: ocaml build] [ocb-stubblr: ocaml build] [ppxlib: dune build]
-> installed mirage-kv-lwt.1.1.0
Processing 133/150: [logs: ocaml build] [ocb-stubblr: ocaml build] [ppxlib: dune build]
- ocamlfind ocamldep -package ocamlbuild -package astring -package bytes -modules src/ocb_stubblr.ml > src/ocb_stubblr.ml.depends
- ocamlfind ocamldep -package ocamlbuild -package astring -package bytes -modules src/ocb_stubblr.mli > src/ocb_stubblr.mli.depends
- ocamlfind ocamlc -c -g -bin-annot -safe-string -package ocamlbuild -package astring -package bytes -w A-4-29-33-40-41-42-43-34-44-48 -color always -I src -I src-topkg -o src/ocb_stubblr.cmi src/ocb_stubblr.mli
- ocamlfind ocamlopt -c -g -bin-annot -safe-string -package ocamlbuild -package astring -package bytes -w A-4-29-33-40-41-42-43-34-44-48 -color always -I src -I src-topkg -o src/ocb_stubblr.cmx src/ocb_stubblr.ml
- ocamlfind ocamlopt -a -package bytes -I src src/ocb_stubblr.cmx -o src/ocb-stubblr.cmxa
- ocamlfind ocamlopt -shared -linkall -package bytes -I src src/ocb-stubblr.cmxa -o src/ocb-stubblr.cmxs
- ocamlfind ocamlc -c -g -bin-annot -safe-string -package ocamlbuild -package astring -package bytes -w A-4-29-33-40-41-42-43-34-44-48 -color always -I src -I src-topkg -o src/ocb_stubblr.cmo src/ocb_stubblr.ml
- ocamlfind ocamlc -a -package bytes -I src src/ocb_stubblr.cmo -o src/ocb-stubblr.cma
- ocamlfind ocamldep -package topkg -package bytes -modules src-topkg/ocb_stubblr_topkg.ml > src-topkg/ocb_stubblr_topkg.ml.depends
- ocamlfind ocamldep -package topkg -package bytes -modules src-topkg/ocb_stubblr_topkg.mli > src-topkg/ocb_stubblr_topkg.mli.depends
- ocamlfind ocamlc -c -g -bin-annot -safe-string -package topkg -package bytes -w A-4-29-33-40-41-42-43-34-44-48 -color always -I src-topkg -I src -o src-topkg/ocb_stubblr_topkg.cmi src-topkg/ocb_stubblr_topkg.mli
- ocamlfind ocamlopt -c -g -bin-annot -safe-string -package topkg -package bytes -w A-4-29-33-40-41-42-43-34-44-48 -color always -I src-topkg -I src -o src-topkg/ocb_stubblr_topkg.cmx src-topkg/ocb_stubblr_topkg.ml
- ocamlfind ocamlopt -a -package bytes -I src-topkg src-topkg/ocb_stubblr_topkg.cmx -o src-topkg/ocb-stubblr-topkg.cmxa
- ocamlfind ocamlopt -shared -linkall -package bytes -I src-topkg src-topkg/ocb-stubblr-topkg.cmxa -o src-topkg/ocb-stubblr-topkg.cmxs
- ocamlfind ocamlc -c -g -bin-annot -safe-string -package topkg -package bytes -w A-4-29-33-40-41-42-43-34-44-48 -color always -I src-topkg -I src -o src-topkg/ocb_stubblr_topkg.cmo src-topkg/ocb_stubblr_topkg.ml
- ocamlfind ocamlc -a -package bytes -I src-topkg src-topkg/ocb_stubblr_topkg.cmo -o src-topkg/ocb-stubblr-topkg.cma
- # No parallelism done
-> compiled  ocb-stubblr.0.1.1-1
Processing 133/150: [logs: ocaml build] [ppxlib: dune build]
-> installed ocb-stubblr.0.1.1-1
Processing 134/150: [logs: ocaml build] [ppxlib: dune build]
Processing 135/150: [logs: ocaml build] [named-pipe: ocaml build] [ppxlib: dune build]
- ocamlfind ocamldep -modules src/logs.ml > src/logs.ml.depends
- ocamlfind ocamldep -modules src/logs.mli > src/logs.mli.depends
- ocamlfind ocamlc -c -g -bin-annot -safe-string -I src -I test -o src/logs.cmi src/logs.mli
- ocamlfind ocamlopt -c -g -bin-annot -safe-string -I src -I test -o src/logs.cmx src/logs.ml
- ocamlfind ocamlopt -a -I src src/logs.cmx -o src/logs.cmxa
- ocamlfind ocamlopt -shared -linkall -I src src/logs.cmxa -o src/logs.cmxs
- ocamlfind ocamlc -c -g -bin-annot -safe-string -I src -I test -o src/logs.cmo src/logs.ml
- ocamlfind ocamlc -a -I src src/logs.cmo -o src/logs.cma
- ocamlfind ocamldep -package fmt -modules src/logs_fmt.ml > src/logs_fmt.ml.depends
- ocamlfind ocamldep -package fmt -modules src/logs_fmt.mli > src/logs_fmt.mli.depends
- ocamlfind ocamlc -c -g -bin-annot -safe-string -package fmt -I src -I test -o src/logs_fmt.cmi src/logs_fmt.mli
- ocamlfind ocamlopt -c -g -bin-annot -safe-string -package fmt -I src -I test -o src/logs_fmt.cmx src/logs_fmt.ml
- ocamlfind ocamlopt -a -package fmt -I src src/logs_fmt.cmx -o src/logs_fmt.cmxa
- ocamlfind ocamlopt -shared -linkall -package fmt -I src src/logs_fmt.cmxa -o src/logs_fmt.cmxs
- ocamlfind ocamlc -c -g -bin-annot -safe-string -package fmt -I src -I test -o src/logs_fmt.cmo src/logs_fmt.ml
- ocamlfind ocamlc -a -package fmt -I src src/logs_fmt.cmo -o src/logs_fmt.cma
- ocamlfind ocamldep -package cmdliner -modules src/logs_cli.ml > src/logs_cli.ml.depends
- ocamlfind ocamldep -package cmdliner -modules src/logs_cli.mli > src/logs_cli.mli.depends
- ocamlfind ocamlc -c -g -bin-annot -safe-string -package cmdliner -I src -I test -o src/logs_cli.cmi src/logs_cli.mli
- + ocamlfind ocamlc -c -g -bin-annot -safe-string -package cmdliner -I src -I test -o src/logs_cli.cmi src/logs_cli.mli
- File "src/logs_cli.mli", line 15, characters 17-33:
- 15 | val level : ?env:Cmdliner.Arg.env -> ?docs:string -> unit ->
-                       ^^^^^^^^^^^^^^^^
- Alert deprecated: Cmdliner.Arg.env
- Use Cmd.Env.info instead.
- ocamlfind ocamlopt -c -g -bin-annot -safe-string -package cmdliner -I src -I test -o src/logs_cli.cmx src/logs_cli.ml
- ocamlfind ocamlopt -a -package cmdliner -I src src/logs_cli.cmx -o src/logs_cli.cmxa
- ocamlfind ocamlopt -shared -linkall -package cmdliner -I src src/logs_cli.cmxa -o src/logs_cli.cmxs
- ocamlfind ocamlc -c -g -bin-annot -safe-string -package cmdliner -I src -I test -o src/logs_cli.cmo src/logs_cli.ml
- ocamlfind ocamlc -a -package cmdliner -I src src/logs_cli.cmo -o src/logs_cli.cma
- ocamlfind ocamldep -package lwt -modules src/logs_lwt.ml > src/logs_lwt.ml.depends
- ocamlfind ocamldep -package lwt -modules src/logs_lwt.mli > src/logs_lwt.mli.depends
- ocamlfind ocamlc -c -g -bin-annot -safe-string -package lwt -I src -I test -o src/logs_lwt.cmi src/logs_lwt.mli
- ocamlfind ocamlopt -c -g -bin-annot -safe-string -package lwt -I src -I test -o src/logs_lwt.cmx src/logs_lwt.ml
- ocamlfind ocamlopt -a -package lwt -I src src/logs_lwt.cmx -o src/logs_lwt.cmxa
- ocamlfind ocamlopt -shared -linkall -package lwt -I src src/logs_lwt.cmxa -o src/logs_lwt.cmxs
- ocamlfind ocamlc -c -g -bin-annot -safe-string -package lwt -I src -I test -o src/logs_lwt.cmo src/logs_lwt.ml
- ocamlfind ocamlc -a -package lwt -I src src/logs_lwt.cmo -o src/logs_lwt.cma
- ocamlfind ocamldep -package compiler-libs.toplevel -modules src/logs_top.ml > src/logs_top.ml.depends
- ocamlfind ocamlc -c -g -bin-annot -safe-string -package compiler-libs.toplevel -I src -I test -o src/logs_top.cmo src/logs_top.ml
- + ocamlfind ocamlc -c -g -bin-annot -safe-string -package compiler-libs.toplevel -I src -I test -o src/logs_top.cmo src/logs_top.ml
- findlib: [WARNING] Interface topdirs.cmi occurs in several directories: /home/opam/.opam/4.11/lib/ocaml, /home/opam/.opam/4.11/lib/ocaml/compiler-libs
- ocamlfind ocamlopt -c -g -bin-annot -safe-string -package compiler-libs.toplevel -I src -I test -o src/logs_top.cmx src/logs_top.ml
- + ocamlfind ocamlopt -c -g -bin-annot -safe-string -package compiler-libs.toplevel -I src -I test -o src/logs_top.cmx src/logs_top.ml
- findlib: [WARNING] Interface topdirs.cmi occurs in several directories: /home/opam/.opam/4.11/lib/ocaml, /home/opam/.opam/4.11/lib/ocaml/compiler-libs
- File "_none_", line 1:
- Warning 58: no cmx file was found in path for module Toploop, and its interface was not compiled with -opaque
- ocamlfind ocamlopt -a -package compiler-libs.toplevel -I src src/logs_top.cmx -o src/logs_top.cmxa
- + ocamlfind ocamlopt -a -package compiler-libs.toplevel -I src src/logs_top.cmx -o src/logs_top.cmxa
- findlib: [WARNING] Interface topdirs.cmi occurs in several directories: /home/opam/.opam/4.11/lib/ocaml, /home/opam/.opam/4.11/lib/ocaml/compiler-libs
- ocamlfind ocamlopt -shared -linkall -package compiler-libs.toplevel -I src src/logs_top.cmxa -o src/logs_top.cmxs
- + ocamlfind ocamlopt -shared -linkall -package compiler-libs.toplevel -I src src/logs_top.cmxa -o src/logs_top.cmxs
- findlib: [WARNING] Interface topdirs.cmi occurs in several directories: /home/opam/.opam/4.11/lib/ocaml, /home/opam/.opam/4.11/lib/ocaml/compiler-libs
- ocamlfind ocamlc -a -package compiler-libs.toplevel -I src src/logs_top.cmo -o src/logs_top.cma
- + ocamlfind ocamlc -a -package compiler-libs.toplevel -I src src/logs_top.cmo -o src/logs_top.cma
- findlib: [WARNING] Interface topdirs.cmi occurs in several directories: /home/opam/.opam/4.11/lib/ocaml, /home/opam/.opam/4.11/lib/ocaml/compiler-libs
- ocamlfind ocamldep -package threads -modules src/logs_threaded.ml > src/logs_threaded.ml.depends
- ocamlfind ocamldep -package threads -modules src/logs_threaded.mli > src/logs_threaded.mli.depends
- ocamlfind ocamlc -c -g -bin-annot -safe-string -thread -package threads -I src -I test -o src/logs_threaded.cmi src/logs_threaded.mli
- ocamlfind ocamlopt -c -g -bin-annot -safe-string -thread -package threads -I src -I test -o src/logs_threaded.cmx src/logs_threaded.ml
- ocamlfind ocamlopt -a -thread -package threads -I src src/logs_threaded.cmx -o src/logs_threaded.cmxa
- ocamlfind ocamlopt -shared -linkall -thread -package threads -I src src/logs_threaded.cmxa -o src/logs_threaded.cmxs
- ocamlfind ocamlc -c -g -bin-annot -safe-string -thread -package threads -I src -I test -o src/logs_threaded.cmo src/logs_threaded.ml
- ocamlfind ocamlc -a -thread -package threads -I src src/logs_threaded.cmo -o src/logs_threaded.cma
- # No parallelism done
-> compiled  logs.0.7.0
Processing 135/150: [named-pipe: ocaml build] [ppxlib: dune build]
-> installed logs.0.7.0
Processing 136/150: [named-pipe: ocaml build] [ppxlib: dune build]
Processing 137/150: [mirage-flow-lwt: dune build] [named-pipe: ocaml build] [ppxlib: dune build]
-       ocamlc lwt/.mirage_flow_lwt.objs/byte/mirage_flow_lwt.{cmo,cmt}
- File "lwt/mirage_flow_lwt.ml", line 359, characters 28-36:
- 359 |             if verbose then Fmt.strf "[%S]" @@ Cstruct.to_string buf
-                                   ^^^^^^^^
- Alert deprecated: Fmt.strf
- use Fmt.str instead.
- File "lwt/mirage_flow_lwt.ml", line 360, characters 17-25:
- 360 |             else Fmt.strf "%d bytes" (Cstruct.len buf)
-                        ^^^^^^^^
- Alert deprecated: Fmt.strf
- use Fmt.str instead.
-     ocamlopt lwt/.mirage_flow_lwt.objs/native/mirage_flow_lwt.{cmx,o}
- File "lwt/mirage_flow_lwt.ml", line 359, characters 28-36:
- 359 |             if verbose then Fmt.strf "[%S]" @@ Cstruct.to_string buf
-                                   ^^^^^^^^
- Alert deprecated: Fmt.strf
- use Fmt.str instead.
- File "lwt/mirage_flow_lwt.ml", line 360, characters 17-25:
- 360 |             else Fmt.strf "%d bytes" (Cstruct.len buf)
-                        ^^^^^^^^
- Alert deprecated: Fmt.strf
- use Fmt.str instead.
-> compiled  mirage-flow-lwt.1.6.0
Processing 137/150: [named-pipe: ocaml build] [ppxlib: dune build]
-> installed mirage-flow-lwt.1.6.0
Processing 138/150: [named-pipe: ocaml build] [ppxlib: dune build]
Processing 139/150: [mirage-channel-lwt: dune build] [named-pipe: ocaml build] [ppxlib: dune build]
-> compiled  mirage-channel-lwt.3.2.0
Processing 139/150: [named-pipe: ocaml build] [ppxlib: dune build]
-> installed mirage-channel-lwt.3.2.0
Processing 140/150: [named-pipe: ocaml build] [ppxlib: dune build]
- ocamlfind ocamlopt -package unix -package ocamlbuild -linkpkg -package ocb-stubblr myocamlbuild.ml /home/opam/.opam/4.11/lib/ocamlbuild/ocamlbuild.cmx -o myocamlbuild
- Adding cclib(-I '/home/opam/.opam/4.11/lib/lwt')
- ocamlfind ocamlc -g -package 'bytes unix' -c lib/named_pipe_stubs.c
- mv named_pipe_stubs.o lib/named_pipe_stubs.o
- ocamlfind ocamlmklib -o lib/named_pipe -g lib/named_pipe_stubs.o
- ocamlfind ocamldep -package 'bytes unix' -modules lib/named_pipe.ml > lib/named_pipe.ml.depends
- ocamlfind ocamldep -package 'bytes unix' -modules lib/named_pipe.mli > lib/named_pipe.mli.depends
- ocamlfind ocamlc -c -g -bin-annot -short-paths -package 'bytes unix' -warn-error +1..49 -w A-4-41-44 -I lib -I lwt -o lib/named_pipe.cmi lib/named_pipe.mli
- ocamlfind ocamlopt -c -g -bin-annot -short-paths -package 'bytes unix' -warn-error +1..49 -w A-4-41-44 -I lib -I lwt -o lib/named_pipe.cmx lib/named_pipe.ml
- ocamlfind ocamlopt -a -cclib -lnamed_pipe -package 'bytes unix' -I lib lib/named_pipe.cmx -o lib/named_pipe.cmxa
- ocamlfind ocamlopt -shared -linkall -I . -I lib -I lwt -package 'bytes unix' -I lib lib/named_pipe.cmxa -o lib/named_pipe.cmxs
- ocamlfind ocamlc -c -g -bin-annot -short-paths -package 'bytes unix' -warn-error +1..49 -w A-4-41-44 -I lib -I lwt -o lib/named_pipe.cmo lib/named_pipe.ml
- ocamlfind ocamlc -a -dllib -lnamed_pipe -cclib -lnamed_pipe -package 'bytes unix' -I lib lib/named_pipe.cmo -o lib/named_pipe.cma
- ocamlfind ocamlc -g -package 'lwt lwt.unix' -package 'bytes unix' -c lwt/named_pipe_lwt_stubs.c
- + ocamlfind ocamlc -g -package 'lwt lwt.unix' -package 'bytes unix' -c lwt/named_pipe_lwt_stubs.c
- ocamlfind: [WARNING] Package `threads': Linking problems may arise because of the missing -thread or -vmthread switch
- mv named_pipe_lwt_stubs.o lwt/named_pipe_lwt_stubs.o
- ocamlfind ocamlmklib -o lwt/named_pipe_lwt -g lwt/named_pipe_lwt_stubs.o
- ocamlfind ocamldep -package 'lwt lwt.unix' -package 'bytes unix' -modules lwt/named_pipe_lwt.ml > lwt/named_pipe_lwt.ml.depends
- ocamlfind ocamldep -package 'lwt lwt.unix' -package 'bytes unix' -modules lwt/named_pipe_lwt.mli > lwt/named_pipe_lwt.mli.depends
- ocamlfind ocamlc -c -g -bin-annot -short-paths -package 'lwt lwt.unix' -package 'bytes unix' -warn-error +1..49 -w A-4-41-44 -I lwt -I lib -o lwt/named_pipe_lwt.cmi lwt/named_pipe_lwt.mli
- + ocamlfind ocamlc -c -g -bin-annot -short-paths -package 'lwt lwt.unix' -package 'bytes unix' -warn-error +1..49 -w A-4-41-44 -I lwt -I lib -o lwt/named_pipe_lwt.cmi lwt/named_pipe_lwt.mli
- ocamlfind: [WARNING] Package `threads': Linking problems may arise because of the missing -thread or -vmthread switch
- ocamlfind ocamlopt -c -g -bin-annot -short-paths -package 'lwt lwt.unix' -package 'bytes unix' -warn-error +1..49 -w A-4-41-44 -I lwt -I lib -o lwt/named_pipe_lwt.cmx lwt/named_pipe_lwt.ml
- + ocamlfind ocamlopt -c -g -bin-annot -short-paths -package 'lwt lwt.unix' -package 'bytes unix' -warn-error +1..49 -w A-4-41-44 -I lwt -I lib -o lwt/named_pipe_lwt.cmx lwt/named_pipe_lwt.ml
- ocamlfind: [WARNING] Package `threads': Linking problems may arise because of the missing -thread or -vmthread switch
- ocamlfind ocamlopt -a -cclib -lnamed_pipe_lwt -package 'lwt lwt.unix' -package 'bytes unix' -I lwt lwt/named_pipe_lwt.cmx -o lwt/named_pipe_lwt.cmxa
- + ocamlfind ocamlopt -a -cclib -lnamed_pipe_lwt -package 'lwt lwt.unix' -package 'bytes unix' -I lwt lwt/named_pipe_lwt.cmx -o lwt/named_pipe_lwt.cmxa
- ocamlfind: [WARNING] Package `threads': Linking problems may arise because of the missing -thread or -vmthread switch
- ocamlfind ocamlopt -shared -linkall -I . -I lib -I lwt -package 'lwt lwt.unix' -package 'bytes unix' -I lwt lwt/named_pipe_lwt.cmxa -o lwt/named_pipe_lwt.cmxs
- + ocamlfind ocamlopt -shared -linkall -I . -I lib -I lwt -package 'lwt lwt.unix' -package 'bytes unix' -I lwt lwt/named_pipe_lwt.cmxa -o lwt/named_pipe_lwt.cmxs
- ocamlfind: [WARNING] Package `threads': Linking problems may arise because of the missing -thread or -vmthread switch
- ocamlfind ocamlc -c -g -bin-annot -short-paths -package 'lwt lwt.unix' -package 'bytes unix' -warn-error +1..49 -w A-4-41-44 -I lwt -I lib -o lwt/named_pipe_lwt.cmo lwt/named_pipe_lwt.ml
- + ocamlfind ocamlc -c -g -bin-annot -short-paths -package 'lwt lwt.unix' -package 'bytes unix' -warn-error +1..49 -w A-4-41-44 -I lwt -I lib -o lwt/named_pipe_lwt.cmo lwt/named_pipe_lwt.ml
- ocamlfind: [WARNING] Package `threads': Linking problems may arise because of the missing -thread or -vmthread switch
- ocamlfind ocamlc -a -dllib -lnamed_pipe_lwt -cclib -lnamed_pipe_lwt -package 'lwt lwt.unix' -package 'bytes unix' -I lwt lwt/named_pipe_lwt.cmo -o lwt/named_pipe_lwt.cma
- + ocamlfind ocamlc -a -dllib -lnamed_pipe_lwt -cclib -lnamed_pipe_lwt -package 'lwt lwt.unix' -package 'bytes unix' -I lwt lwt/named_pipe_lwt.cmo -o lwt/named_pipe_lwt.cma
- ocamlfind: [WARNING] Package `threads': Linking problems may arise because of the missing -thread or -vmthread switch
- ocamlfind ocamldep -package 'lwt.unix cmdliner' -package 'bytes unix' -modules src/pipecat.ml > src/pipecat.ml.depends
- ocamlfind ocamlc -c -g -bin-annot -short-paths -package 'lwt.unix cmdliner' -package 'bytes unix' -warn-error +1..49 -w A-4-41-44 -I src -I lib -I lwt -o src/pipecat.cmo src/pipecat.ml
- + ocamlfind ocamlc -c -g -bin-annot -short-paths -package 'lwt.unix cmdliner' -package 'bytes unix' -warn-error +1..49 -w A-4-41-44 -I src -I lib -I lwt -o src/pipecat.cmo src/pipecat.ml
- ocamlfind: [WARNING] Package `threads': Linking problems may arise because of the missing -thread or -vmthread switch
- File "src/pipecat.ml", line 115, characters 8-12:
- 115 |   Term.(pure main $ listen $ echo $ path),
-               ^^^^
- Error (alert deprecated): Cmdliner.Term.pure
- Use Term.const instead.
- File "src/pipecat.ml", line 116, characters 2-11:
- 116 |   Term.info "pipecat" ~version:"0.1" ~doc ~man
-         ^^^^^^^^^
- Error (alert deprecated): Cmdliner.Term.info
- Use Cmd.info instead.
- File "src/pipecat.ml", line 123, characters 8-17:
- 123 |   match Term.eval cmd with `Error _ -> exit 1 | _ -> exit 0
-               ^^^^^^^^^
- Error (alert deprecated): Cmdliner.Term.eval
- Use Cmd.v and one of Cmd.eval* instead.
- Command exited with code 2.
- pkg.ml: [ERROR] cmd ['ocamlbuild' '-use-ocamlfind' '-classic-display' '-j' '4' '-tag' 'debug'
-      '-build-dir' '_build' '-plugin-tag' 'package(ocb-stubblr)' 'opam'
-      'pkg/META' 'CHANGES.md' 'LICENSE.md' 'README.md' 'lib/named_pipe.a'
-      'lib/named_pipe.cmxs' 'lib/named_pipe.cmxa' 'lib/named_pipe.cma'
-      'lib/named_pipe.cmx' 'lib/named_pipe.cmi' 'lib/named_pipe.mli'
-      'lib/dllnamed_pipe.so' 'lib/libnamed_pipe.a' 'lwt/named_pipe_lwt.a'
-      'lwt/named_pipe_lwt.cmxs' 'lwt/named_pipe_lwt.cmxa'
-      'lwt/named_pipe_lwt.cma' 'lwt/named_pipe_lwt.cmx'
-      'lwt/named_pipe_lwt.cmi' 'lwt/named_pipe_lwt.mli'
-      'lwt/dllnamed_pipe_lwt.so' 'lwt/libnamed_pipe_lwt.a'
-      'src/pipecat.native']: exited with 10
[ERROR] The compilation of named-pipe.0.4.0 failed at "ocaml pkg/pkg.ml build --pinned false".
Processing 140/150: [ppxlib: dune build]
Processing 141/150: [ppxlib: dune build]
+ /home/opam/.opam/4.11/bin/dune "build" "-p" "ppxlib" "-j" "255" (CWD=/home/opam/.opam/4.11/.opam-switch/build/ppxlib.0.15.0)
-       ocamlc src/gen/.gen_ast_pattern.eobjs/byte/import.{cmi,cmo,cmt}
- File "src/gen/import.ml", line 14, characters 21-36:
- 14 |   let lident x = mk (Longident.parse x)
-                           ^^^^^^^^^^^^^^^
- Alert deprecated: Longident.parse
- this function may misparse its input,
- use "Parse.longident" or "Longident.unflatten"
-     ocamlopt src/gen/.gen_ast_pattern.eobjs/native/import.{cmx,o}
- File "src/gen/import.ml", line 14, characters 21-36:
- 14 |   let lident x = mk (Longident.parse x)
-                           ^^^^^^^^^^^^^^^
- Alert deprecated: Longident.parse
- this function may misparse its input,
- use "Parse.longident" or "Longident.unflatten"
-> compiled  ppxlib.0.15.0
-> installed ppxlib.0.15.0
Processing 143/150: [ppx_deriving: dune build]
Processing 144/150: [ppx_deriving: dune build] [ppx_sexp_conv: dune build]
-> compiled  ppx_sexp_conv.v0.13.0
Processing 144/150: [ppx_deriving: dune build]
-> installed ppx_sexp_conv.v0.13.0
Processing 145/150: [ppx_deriving: dune build]
+ /home/opam/.opam/4.11/bin/dune "build" "-p" "ppx_deriving" "-j" "255" (CWD=/home/opam/.opam/4.11/.opam-switch/build/ppx_deriving.5.1)
-> compiled  ppx_deriving.5.1
-> installed ppx_deriving.5.1

#=== ERROR while compiling named-pipe.0.4.0 ===================================#
# context              2.1.5 | linux/x86_64 | ocaml-base-compiler.4.11.2 | file:///src
# path                 ~/.opam/4.11/.opam-switch/build/named-pipe.0.4.0
# command              ~/.opam/4.11/bin/ocaml pkg/pkg.ml build --pinned false
# exit-code            1
# env-file             ~/.opam/log/named-pipe-114-a771f6.env
# output-file          ~/.opam/log/named-pipe-114-a771f6.out
### output ###
# ocamlfind ocamlopt -package unix -package ocamlbuild -linkpkg -package ocb-stubblr myocamlbuild.ml /home/opam/.opam/4.11/lib/ocamlbuild/ocamlbuild.cmx -o myocamlbuild
# Adding cclib(-I '/home/opam/.opam/4.11/lib/lwt')
# ocamlfind ocamlc -g -package 'bytes unix' -c lib/named_pipe_stubs.c
# mv named_pipe_stubs.o lib/named_pipe_stubs.o
# ocamlfind ocamlmklib -o lib/named_pipe -g lib/named_pipe_stubs.o
# ocamlfind ocamldep -package 'bytes unix' -modules lib/named_pipe.ml > lib/named_pipe.ml.depends
# ocamlfind ocamldep -package 'bytes unix' -modules lib/named_pipe.mli > lib/named_pipe.mli.depends
# ocamlfind ocamlc -c -g -bin-annot -short-paths -package 'bytes unix' -warn-error +1..49 -w A-4-41-44 -I lib -I lwt -o lib/named_pipe.cmi lib/named_pipe.mli
# ocamlfind ocamlopt -c -g -bin-annot -short-paths -package 'bytes unix' -warn-error +1..49 -w A-4-41-44 -I lib -I lwt -o lib/named_pipe.cmx lib/named_pipe.ml
# ocamlfind ocamlopt -a -cclib -lnamed_pipe -package 'bytes unix' -I lib lib/named_pipe.cmx -o lib/named_pipe.cmxa
# ocamlfind ocamlopt -shared -linkall -I . -I lib -I lwt -package 'bytes unix' -I lib lib/named_pipe.cmxa -o lib/named_pipe.cmxs
# ocamlfind ocamlc -c -g -bin-annot -short-paths -package 'bytes unix' -warn-error +1..49 -w A-4-41-44 -I lib -I lwt -o lib/named_pipe.cmo lib/named_pipe.ml
# ocamlfind ocamlc -a -dllib -lnamed_pipe -cclib -lnamed_pipe -package 'bytes unix' -I lib lib/named_pipe.cmo -o lib/named_pipe.cma
# ocamlfind ocamlc -g -package 'lwt lwt.unix' -package 'bytes unix' -c lwt/named_pipe_lwt_stubs.c
# + ocamlfind ocamlc -g -package 'lwt lwt.unix' -package 'bytes unix' -c lwt/named_pipe_lwt_stubs.c
# ocamlfind: [WARNING] Package `threads': Linking problems may arise because of the missing -thread or -vmthread switch
# mv named_pipe_lwt_stubs.o lwt/named_pipe_lwt_stubs.o
# ocamlfind ocamlmklib -o lwt/named_pipe_lwt -g lwt/named_pipe_lwt_stubs.o
# ocamlfind ocamldep -package 'lwt lwt.unix' -package 'bytes unix' -modules lwt/named_pipe_lwt.ml > lwt/named_pipe_lwt.ml.depends
# ocamlfind ocamldep -package 'lwt lwt.unix' -package 'bytes unix' -modules lwt/named_pipe_lwt.mli > lwt/named_pipe_lwt.mli.depends
# ocamlfind ocamlc -c -g -bin-annot -short-paths -package 'lwt lwt.unix' -package 'bytes unix' -warn-error +1..49 -w A-4-41-44 -I lwt -I lib -o lwt/named_pipe_lwt.cmi lwt/named_pipe_lwt.mli
# + ocamlfind ocamlc -c -g -bin-annot -short-paths -package 'lwt lwt.unix' -package 'bytes unix' -warn-error +1..49 -w A-4-41-44 -I lwt -I lib -o lwt/named_pipe_lwt.cmi lwt/named_pipe_lwt.mli
# ocamlfind: [WARNING] Package `threads': Linking problems may arise because of the missing -thread or -vmthread switch
# ocamlfind ocamlopt -c -g -bin-annot -short-paths -package 'lwt lwt.unix' -package 'bytes unix' -warn-error +1..49 -w A-4-41-44 -I lwt -I lib -o lwt/named_pipe_lwt.cmx lwt/named_pipe_lwt.ml
# + ocamlfind ocamlopt -c -g -bin-annot -short-paths -package 'lwt lwt.unix' -package 'bytes unix' -warn-error +1..49 -w A-4-41-44 -I lwt -I lib -o lwt/named_pipe_lwt.cmx lwt/named_pipe_lwt.ml
# ocamlfind: [WARNING] Package `threads': Linking problems may arise because of the missing -thread or -vmthread switch
# ocamlfind ocamlopt -a -cclib -lnamed_pipe_lwt -package 'lwt lwt.unix' -package 'bytes unix' -I lwt lwt/named_pipe_lwt.cmx -o lwt/named_pipe_lwt.cmxa
# + ocamlfind ocamlopt -a -cclib -lnamed_pipe_lwt -package 'lwt lwt.unix' -package 'bytes unix' -I lwt lwt/named_pipe_lwt.cmx -o lwt/named_pipe_lwt.cmxa
# ocamlfind: [WARNING] Package `threads': Linking problems may arise because of the missing -thread or -vmthread switch
# ocamlfind ocamlopt -shared -linkall -I . -I lib -I lwt -package 'lwt lwt.unix' -package 'bytes unix' -I lwt lwt/named_pipe_lwt.cmxa -o lwt/named_pipe_lwt.cmxs
# + ocamlfind ocamlopt -shared -linkall -I . -I lib -I lwt -package 'lwt lwt.unix' -package 'bytes unix' -I lwt lwt/named_pipe_lwt.cmxa -o lwt/named_pipe_lwt.cmxs
# ocamlfind: [WARNING] Package `threads': Linking problems may arise because of the missing -thread or -vmthread switch
# ocamlfind ocamlc -c -g -bin-annot -short-paths -package 'lwt lwt.unix' -package 'bytes unix' -warn-error +1..49 -w A-4-41-44 -I lwt -I lib -o lwt/named_pipe_lwt.cmo lwt/named_pipe_lwt.ml
# + ocamlfind ocamlc -c -g -bin-annot -short-paths -package 'lwt lwt.unix' -package 'bytes unix' -warn-error +1..49 -w A-4-41-44 -I lwt -I lib -o lwt/named_pipe_lwt.cmo lwt/named_pipe_lwt.ml
# ocamlfind: [WARNING] Package `threads': Linking problems may arise because of the missing -thread or -vmthread switch
# ocamlfind ocamlc -a -dllib -lnamed_pipe_lwt -cclib -lnamed_pipe_lwt -package 'lwt lwt.unix' -package 'bytes unix' -I lwt lwt/named_pipe_lwt.cmo -o lwt/named_pipe_lwt.cma
# + ocamlfind ocamlc -a -dllib -lnamed_pipe_lwt -cclib -lnamed_pipe_lwt -package 'lwt lwt.unix' -package 'bytes unix' -I lwt lwt/named_pipe_lwt.cmo -o lwt/named_pipe_lwt.cma
# ocamlfind: [WARNING] Package `threads': Linking problems may arise because of the missing -thread or -vmthread switch
# ocamlfind ocamldep -package 'lwt.unix cmdliner' -package 'bytes unix' -modules src/pipecat.ml > src/pipecat.ml.depends
# ocamlfind ocamlc -c -g -bin-annot -short-paths -package 'lwt.unix cmdliner' -package 'bytes unix' -warn-error +1..49 -w A-4-41-44 -I src -I lib -I lwt -o src/pipecat.cmo src/pipecat.ml
# + ocamlfind ocamlc -c -g -bin-annot -short-paths -package 'lwt.unix cmdliner' -package 'bytes unix' -warn-error +1..49 -w A-4-41-44 -I src -I lib -I lwt -o src/pipecat.cmo src/pipecat.ml
# ocamlfind: [WARNING] Package `threads': Linking problems may arise because of the missing -thread or -vmthread switch
# File "src/pipecat.ml", line 115, characters 8-12:
# 115 |   Term.(pure main $ listen $ echo $ path),
#               ^^^^
# Error (alert deprecated): Cmdliner.Term.pure
# Use Term.const instead.
# File "src/pipecat.ml", line 116, characters 2-11:
# 116 |   Term.info "pipecat" ~version:"0.1" ~doc ~man
#         ^^^^^^^^^
# Error (alert deprecated): Cmdliner.Term.info
# Use Cmd.info instead.
# File "src/pipecat.ml", line 123, characters 8-17:
# 123 |   match Term.eval cmd with `Error _ -> exit 1 | _ -> exit 0
#               ^^^^^^^^^
# Error (alert deprecated): Cmdliner.Term.eval
# Use Cmd.v and one of Cmd.eval* instead.
# Command exited with code 2.
# pkg.ml: [ERROR] cmd ['ocamlbuild' '-use-ocamlfind' '-classic-display' '-j' '4' '-tag' 'debug'
#      '-build-dir' '_build' '-plugin-tag' 'package(ocb-stubblr)' 'opam'
#      'pkg/META' 'CHANGES.md' 'LICENSE.md' 'README.md' 'lib/named_pipe.a'
#      'lib/named_pipe.cmxs' 'lib/named_pipe.cmxa' 'lib/named_pipe.cma'
#      'lib/named_pipe.cmx' 'lib/named_pipe.cmi' 'lib/named_pipe.mli'
#      'lib/dllnamed_pipe.so' 'lib/libnamed_pipe.a' 'lwt/named_pipe_lwt.a'
#      'lwt/named_pipe_lwt.cmxs' 'lwt/named_pipe_lwt.cmxa'
#      'lwt/named_pipe_lwt.cma' 'lwt/named_pipe_lwt.cmx'
#      'lwt/named_pipe_lwt.cmi' 'lwt/named_pipe_lwt.mli'
#      'lwt/dllnamed_pipe_lwt.so' 'lwt/libnamed_pipe_lwt.a'
#      'src/pipecat.native']: exited with 10



<><> Error report <><><><><><><><><><><><><><><><><><><><><><><><><><><><><><><>
+- The following actions were aborted
| - install protocol-9p      0.11.3
| - install protocol-9p-unix 0.11.3
+- 
+- The following actions failed
| - build named-pipe 0.4.0
+- 
+- The following changes have been performed (the rest was aborted)
| - install asetmap                 0.8.1
| - install astring                 0.8.5
| - install base                    v0.13.2
| - install base-bytes              base
| - install bigarray-compat         1.1.0
| - install cmdliner                1.2.0
| - install cppo                    1.6.9
| - install cstruct                 3.7.0
| - install cstruct-lwt             3.7.0
| - install dune-configurator       1.0.0
| - install fmt                     0.9.0
| - install io-page                 2.3.0
| - install io-page-unix            2.3.0
| - install jbuilder                transition
| - install logs                    0.7.0
| - install lwt                     4.5.0
| - install mirage-channel          3.2.0
| - install mirage-channel-lwt      3.2.0
| - install mirage-clock            2.0.0
| - install mirage-device           1.2.0
| - install mirage-flow             1.6.0
| - install mirage-flow-lwt         1.6.0
| - install mirage-kv               1.1.1
| - install mirage-kv-lwt           1.1.0
| - install mmap                    1.2.0
| - install num                     1.5
| - install ocaml-compiler-libs     v0.12.3
| - install ocaml-migrate-parsetree 1.8.0
| - install ocamlbuild              0.14.3
| - install ocb-stubblr             0.1.1-1
| - install ocplib-endian           1.2
| - install parsexp                 v0.13.0
| - install ppx_derivers            1.2.1
| - install ppx_deriving            5.1
| - install ppx_sexp_conv           v0.13.0
| - install ppx_tools               6.6
| - install ppxlib                  0.15.0
| - install prometheus              1.1
| - install re                      1.9.0
| - install result                  1.5
| - install rresult                 0.7.0
| - install seq                     base
| - install sexplib                 v0.13.0
| - install sexplib0                v0.13.0
| - install stdlib-shims            0.3.0
| - install topkg                   1.0.7
| - install win-error               1.0
+- 

<><> lwt.4.5.0 installed successfully <><><><><><><><><><><><><><><><><><><><><>
=> Lwt 5.0.0 will make some breaking changes in December 2019. See
     https://github.com/ocsigen/lwt/issues/584

<><> jbuilder.transition installed successfully <><><><><><><><><><><><><><><><>
=> Jbuilder has been renamed and the jbuilder package is now a transition package. Use the dune package instead.
# Run eval $(opam env) to update the current shell environment

The former state can be restored with:
    /usr/bin/opam switch import "/home/opam/.opam/4.11/.opam-switch/backup/state-20240129182924.export"
'opam --cli=2.1 install protocol-9p-unix.0.11.3 win-error.1.0 topkg.1.0.7 stdlib-shims.0.3.0 sexplib0.v0.13.0 sexplib.v0.13.0 seq.base rresult.0.7.0 result.1.5 re.1.9.0 protocol-9p.0.11.3 prometheus.1.1 ppxlib.0.15.0 ppx_tools.6.6 ppx_sexp_conv.v0.13.0 ppx_deriving.5.1 ppx_derivers.1.2.1 parsexp.v0.13.0 ocplib-endian.1.2 ocb-stubblr.0.1.1-1 ocamlfind.1.9.6 ocamlbuild.0.14.3 ocaml-migrate-parsetree.1.8.0 ocaml-compiler-libs.v0.12.3 num.1.5 named-pipe.0.4.0 mmap.1.2.0 mirage-kv-lwt.1.1.0 mirage-kv.1.1.1 mirage-flow-lwt.1.6.0 mirage-flow.1.6.0 mirage-device.1.2.0 mirage-clock.2.0.0 mirage-channel-lwt.3.2.0 mirage-channel.3.2.0 lwt.4.5.0 logs.0.7.0 jbuilder.transition io-page-unix.2.3.0 io-page.2.3.0 fmt.0.9.0 dune-configurator.1.0.0 dune.1.11.4 cstruct-lwt.3.7.0 cstruct.3.7.0 cppo.1.6.9 cmdliner.1.2.0 bigarray-compat.1.1.0 base-bytes.base base.v0.13.2 astring.0.8.5 asetmap.0.8.1 --verbose --yes --confirm-level=unsafe-yes' failed.
OCaml

Innovation. Community. Security.