package octez-smart-rollup-node-PtNairob

  1. Overview
  2. Docs
On This Page
  1. Error log

octez-smart-rollup-node-PtNairob 20.1

Error log

The package failed to build. The error log from opam follows.

[NOTE] Package dune is already installed (current version is 3.17.2).
[NOTE] Package ocamlfind is already installed (current version is 1.9.8).
The following actions will be performed:
=== install 201 packages
  - install aches                            1.1.0
  - install aches-lwt                        1.1.0
  - install alcotest                         1.8.0
  - install angstrom                         0.16.1
  - install asetmap                          0.8.1
  - install asn1-combinators                 0.3.2
  - install astring                          0.8.5
  - install base                             v0.16.3
  - install base-bytes                       base
  - install base64                           3.5.1
  - install bheap                            2.0.0
  - install bigarray-compat                  1.1.0
  - install bigstring                        0.3
  - install bigstringaf                      0.10.0
  - install bls12-381                        20.1
  - install bos                              0.2.1
  - install ca-certs                         1.0.0
  - install camlp-streams                    5.0.1
  - install camlzip                          1.11
  - install checkseum                        0.5.2
  - install clap                             0.3.0
  - install class_group_vdf                  0.0.5
  - install cmdliner                         1.3.0
  - install cohttp                           5.3.1
  - install cohttp-lwt                       5.3.0
  - install cohttp-lwt-unix                  5.3.0
  - install conduit                          7.1.0
  - install conduit-lwt                      7.1.0
  - install conduit-lwt-unix                 7.1.0
  - install conf-autoconf                    0.2
  - install conf-bash                        1
  - install conf-cmake                       1
  - install conf-g++                         1.0
  - install conf-gmp                         4
  - install conf-gmp-powm-sec                3
  - install conf-libev                       4-12
  - install conf-libffi                      2.0.0
  - install conf-pkg-config                  4
  - install conf-rust                        0.1
  - install conf-rust-2021                   1
  - install conf-which                       1
  - install conf-zlib                        1
  - install cppo                             1.8.0
  - install csexp                            1.5.2
  - install cstruct                          6.2.0
  - install cstruct-lwt                      6.2.0
  - install ctypes                           0.23.0
  - install ctypes-foreign                   0.23.0
  - install ctypes_stubs_js                  0.1
  - install data-encoding                    1.0.1
  - install decompress                       1.5.3
  - install digestif                         1.2.0
  - install domain-name                      0.4.0
  - install dune-configurator                3.17.2
  - install duration                         0.2.1
  - install either                           1.0.0
  - install eqaf                             0.10
  - install ezjsonm                          1.3.0
  - install fmt                              0.9.0
  - install fpath                            0.7.3
  - install gen                              1.1
  - install gmap                             0.3.0
  - install hacl-star                        0.7.2
  - install hacl-star-raw                    0.7.2
  - install hashcons                         1.4.0
  - install hex                              1.5.0
  - install index                            1.6.2
  - install integers                         0.7.0
  - install integers_stubs_js                1.0
  - install ipaddr                           5.6.0
  - install ipaddr-sexp                      5.6.0
  - install jane-street-headers              v0.16.0
  - install js_of_ocaml                      5.9.1
  - install js_of_ocaml-compiler             5.9.1
  - install json-data-encoding               1.0.1
  - install json-data-encoding-bson          1.0.1
  - install jsonm                            1.0.2
  - install jst-config                       v0.16.0
  - install kdf                              1.0.0
  - install logs                             0.7.0
  - install lru                              0.3.1
  - install lwt                              5.9.0
  - install lwt-canceler                     0.3
  - install lwt-exit                         1.0
  - install lwt-watcher                      0.2
  - install macaddr                          5.6.0
  - install magic-mime                       1.3.1
  - install menhir                           20240715
  - install menhirCST                        20240715
  - install menhirLib                        20240715
  - install menhirSdk                        20240715
  - install mirage-crypto                    1.2.0
  - install mirage-crypto-ec                 1.2.0
  - install mirage-crypto-pk                 1.2.0
  - install mirage-crypto-rng                1.2.0
  - install mtime                            2.1.0
  - install ocaml-compiler-libs              v0.12.4
  - install ocaml-migrate-parsetree          2.4.0 (deprecated)
  - install ocaml-syntax-shims               1.0.0
  - install ocamlbuild                       0.15.0
  - install ocamlgraph                       2.1.0
  - install ocp-ocamlres                     0.4
  - install ocplib-endian                    1.2
  - install octez-alcotezt                   20.1
  - install octez-crawler                    20.1
  - install octez-distributed-internal       20.1
  - install octez-distributed-lwt-internal   20.1
  - install octez-injector                   20.1
  - install octez-internal-libs              20.1
  - install octez-l2-libs                    20.1
  - install octez-libs                       20.1
  - install octez-node-config                20.1
  - install octez-proto-libs                 20.1
  - install octez-protocol-017-PtNairob-libs 20.1
  - install octez-protocol-compiler          20.1
  - install octez-shell-libs                 20.1
  - install octez-smart-rollup-node-lib      20.1
  - install octez-smart-rollup-node-PtNairob 20.1
  - install octez-version                    20.1
  - install ohex                             0.2.0
  - install optint                           0.3.0
  - install pprint                           20230830
  - install ppx_assert                       v0.16.0
  - install ppx_base                         v0.16.0
  - install ppx_cold                         v0.16.0
  - install ppx_compare                      v0.16.0
  - install ppx_derivers                     1.2.1
  - install ppx_deriving                     6.0.3
  - install ppx_enumerate                    v0.16.0
  - install ppx_expect                       v0.16.1
  - install ppx_globalize                    v0.16.0
  - install ppx_hash                         v0.16.0
  - install ppx_here                         v0.16.0
  - install ppx_import                       1.11.0
  - install ppx_inline_test                  v0.16.1
  - install ppx_optcomp                      v0.16.0
  - install ppx_repr                         0.7.0
  - install ppx_sexp_conv                    v0.16.0
  - install ppxlib                           0.35.0
  - install prbnmcn-basic-structures         0.0.1
  - install prbnmcn-linalg                   0.0.1
  - install prbnmcn-stats                    0.0.6
  - install pringo                           1.3
  - install progress                         0.4.0
  - install prometheus                       1.2
  - install prometheus-app                   1.2
  - install psq                              0.2.1
  - install ptime                            1.2.0
  - install pure-splitmix                    0.3
  - install pyml                             20231101
  - install qcheck-alcotest                  0.23
  - install qcheck-core                      0.23
  - install re                               1.12.0
  - install repr                             0.7.0
  - install resto                            1.2
  - install resto-acl                        1.2
  - install resto-cohttp                     1.2
  - install resto-cohttp-client              1.2
  - install resto-cohttp-self-serving-client 1.2
  - install resto-cohttp-server              1.2
  - install resto-directory                  1.2
  - install ringo                            1.1.0
  - install rresult                          0.7.0
  - install rusage                           1.0.0
  - install secp256k1-internal               0.4.0
  - install sedlex                           3.3
  - install semaphore-compat                 1.0.2
  - install seq                              base
  - install seqes                            0.3
  - install sexplib0                         v0.16.0
  - install stdcompat                        19
  - install stdint                           0.7.2
  - install stdio                            v0.16.0
  - install stdlib-random                    1.2.0
  - install stdlib-shims                     0.3.0
  - install stringext                        1.6.0
  - install tar                              2.6.0
  - install tar-unix                         2.6.0
  - install terminal                         0.4.0
  - install tezos-benchmark                  20.1
  - install tezos-dac-client-lib             20.1
  - install tezos-dac-lib                    20.1
  - install tezos-dal-node-lib               20.1
  - install tezos-dal-node-services          20.1
  - install tezos-openapi                    20.1
  - install tezos-protocol-017-PtNairob      20.1
  - install tezos-rust-libs                  1.6
  - install tezos-sapling-parameters         1.1.0
  - install tezt                             4.2.0
  - install time_now                         v0.16.0
  - install topkg                            1.0.7
  - install uri                              4.4.0
  - install uri-sexp                         4.4.0
  - install uucp                             16.0.0
  - install uutf                             1.0.3
  - install vector                           1.0.0
  - install x509                             1.0.5
  - install yaml                             3.2.0
  - install yojson                           2.2.2
  - install zarith                           1.13
  - install zarith_stubs_js                  v0.16.1

The following system packages will first need to be installed:
    autoconf cargo cmake libev-dev libffi-dev libgmp-dev pkg-config zlib1g-dev

<><> Handling external dependencies <><><><><><><><><><><><><><><><><><><><><><>

opam believes some required external dependencies are missing. opam can:
> 1. Run apt-get to install them (may need root/sudo access)
  2. Display the recommended apt-get command and wait while you run it manually (e.g. in another terminal)
  3. Continue anyway, and, upon success, permanently register that this external dependency is present, but not detectable
  4. Abort the installation

[1/2/3/4] 1

+ /usr/bin/sudo "apt-get" "install" "-qq" "-yy" "autoconf" "cargo" "cmake" "libev-dev" "libffi-dev" "libgmp-dev" "pkg-config" "zlib1g-dev"
- debconf: delaying package configuration, since apt-utils is not installed
- Selecting previously unselected package libpipeline1:amd64.
- (Reading database ... 
(Reading database ... 5%
(Reading database ... 10%
(Reading database ... 15%
(Reading database ... 20%
(Reading database ... 25%
(Reading database ... 30%
(Reading database ... 35%
(Reading database ... 40%
(Reading database ... 45%
(Reading database ... 50%
(Reading database ... 55%
(Reading database ... 60%
(Reading database ... 65%
(Reading database ... 70%
(Reading database ... 75%
(Reading database ... 80%
(Reading database ... 85%
(Reading database ... 90%
(Reading database ... 95%
(Reading database ... 100%
(Reading database ... 18745 files and directories currently installed.)
- Preparing to unpack .../libpipeline1_1.5.7-1_amd64.deb ...
- Unpacking libpipeline1:amd64 (1.5.7-1) ...
- Selecting previously unselected package binfmt-support.
- Preparing to unpack .../binfmt-support_2.2.2-2_amd64.deb ...
- Unpacking binfmt-support (2.2.2-2) ...
- Selecting previously unselected package libpython3.11-minimal:amd64.
- Preparing to unpack .../libpython3.11-minimal_3.11.2-6+deb12u5_amd64.deb ...
- Unpacking libpython3.11-minimal:amd64 (3.11.2-6+deb12u5) ...
- Selecting previously unselected package python3.11-minimal.
- Preparing to unpack .../python3.11-minimal_3.11.2-6+deb12u5_amd64.deb ...
- Unpacking python3.11-minimal (3.11.2-6+deb12u5) ...
- Setting up libpython3.11-minimal:amd64 (3.11.2-6+deb12u5) ...
- Setting up python3.11-minimal (3.11.2-6+deb12u5) ...
- Selecting previously unselected package python3-minimal.
- (Reading database ... 
(Reading database ... 5%
(Reading database ... 10%
(Reading database ... 15%
(Reading database ... 20%
(Reading database ... 25%
(Reading database ... 30%
(Reading database ... 35%
(Reading database ... 40%
(Reading database ... 45%
(Reading database ... 50%
(Reading database ... 55%
(Reading database ... 60%
(Reading database ... 65%
(Reading database ... 70%
(Reading database ... 75%
(Reading database ... 80%
(Reading database ... 85%
(Reading database ... 90%
(Reading database ... 95%
(Reading database ... 100%
(Reading database ... 19074 files and directories currently installed.)
- Preparing to unpack .../python3-minimal_3.11.2-1+b1_amd64.deb ...
- Unpacking python3-minimal (3.11.2-1+b1) ...
- Selecting previously unselected package media-types.
- Preparing to unpack .../media-types_10.0.0_all.deb ...
- Unpacking media-types (10.0.0) ...
- Selecting previously unselected package libpython3.11-stdlib:amd64.
- Preparing to unpack .../libpython3.11-stdlib_3.11.2-6+deb12u5_amd64.deb ...
- Unpacking libpython3.11-stdlib:amd64 (3.11.2-6+deb12u5) ...
- Selecting previously unselected package python3.11.
- Preparing to unpack .../python3.11_3.11.2-6+deb12u5_amd64.deb ...
- Unpacking python3.11 (3.11.2-6+deb12u5) ...
- Selecting previously unselected package libpython3-stdlib:amd64.
- Preparing to unpack .../libpython3-stdlib_3.11.2-1+b1_amd64.deb ...
- Unpacking libpython3-stdlib:amd64 (3.11.2-1+b1) ...
- Setting up python3-minimal (3.11.2-1+b1) ...
- Selecting previously unselected package python3.
- (Reading database ... 
(Reading database ... 5%
(Reading database ... 10%
(Reading database ... 15%
(Reading database ... 20%
(Reading database ... 25%
(Reading database ... 30%
(Reading database ... 35%
(Reading database ... 40%
(Reading database ... 45%
(Reading database ... 50%
(Reading database ... 55%
(Reading database ... 60%
(Reading database ... 65%
(Reading database ... 70%
(Reading database ... 75%
(Reading database ... 80%
(Reading database ... 85%
(Reading database ... 90%
(Reading database ... 95%
(Reading database ... 100%
(Reading database ... 19484 files and directories currently installed.)
- Preparing to unpack .../00-python3_3.11.2-1+b1_amd64.deb ...
- Unpacking python3 (3.11.2-1+b1) ...
- Selecting previously unselected package m4.
- Preparing to unpack .../01-m4_1.4.19-3_amd64.deb ...
- Unpacking m4 (1.4.19-3) ...
- Selecting previously unselected package autoconf.
- Preparing to unpack .../02-autoconf_2.71-3_all.deb ...
- Unpacking autoconf (2.71-3) ...
- Selecting previously unselected package autotools-dev.
- Preparing to unpack .../03-autotools-dev_20220109.1_all.deb ...
- Unpacking autotools-dev (20220109.1) ...
- Selecting previously unselected package automake.
- Preparing to unpack .../04-automake_1%3a1.16.5-1.3_all.deb ...
- Unpacking automake (1:1.16.5-1.3) ...
- Selecting previously unselected package libhttp-parser2.9:amd64.
- Preparing to unpack .../05-libhttp-parser2.9_2.9.4-5_amd64.deb ...
- Unpacking libhttp-parser2.9:amd64 (2.9.4-5) ...
- Selecting previously unselected package libmbedcrypto7:amd64.
- Preparing to unpack .../06-libmbedcrypto7_2.28.3-1_amd64.deb ...
- Unpacking libmbedcrypto7:amd64 (2.28.3-1) ...
- Selecting previously unselected package libmbedx509-1:amd64.
- Preparing to unpack .../07-libmbedx509-1_2.28.3-1_amd64.deb ...
- Unpacking libmbedx509-1:amd64 (2.28.3-1) ...
- Selecting previously unselected package libmbedtls14:amd64.
- Preparing to unpack .../08-libmbedtls14_2.28.3-1_amd64.deb ...
- Unpacking libmbedtls14:amd64 (2.28.3-1) ...
- Selecting previously unselected package libgit2-1.5:amd64.
- Preparing to unpack .../09-libgit2-1.5_1.5.1+ds-1+deb12u1_amd64.deb ...
- Unpacking libgit2-1.5:amd64 (1.5.1+ds-1+deb12u1) ...
- Selecting previously unselected package libicu72:amd64.
- Preparing to unpack .../10-libicu72_72.1-3_amd64.deb ...
- Unpacking libicu72:amd64 (72.1-3) ...
- Selecting previously unselected package libxml2:amd64.
- Preparing to unpack .../11-libxml2_2.9.14+dfsg-1.3~deb12u1_amd64.deb ...
- Unpacking libxml2:amd64 (2.9.14+dfsg-1.3~deb12u1) ...
- Selecting previously unselected package libz3-4:amd64.
- Preparing to unpack .../12-libz3-4_4.8.12-3.1_amd64.deb ...
- Unpacking libz3-4:amd64 (4.8.12-3.1) ...
- Selecting previously unselected package libllvm14:amd64.
- Preparing to unpack .../13-libllvm14_1%3a14.0.6-12_amd64.deb ...
- Unpacking libllvm14:amd64 (1:14.0.6-12) ...
- Selecting previously unselected package libstd-rust-1.63:amd64.
- Preparing to unpack .../14-libstd-rust-1.63_1.63.0+dfsg1-2_amd64.deb ...
- Unpacking libstd-rust-1.63:amd64 (1.63.0+dfsg1-2) ...
- Selecting previously unselected package libstd-rust-dev:amd64.
- Preparing to unpack .../15-libstd-rust-dev_1.63.0+dfsg1-2_amd64.deb ...
- Unpacking libstd-rust-dev:amd64 (1.63.0+dfsg1-2) ...
- Selecting previously unselected package rustc.
- Preparing to unpack .../16-rustc_1.63.0+dfsg1-2_amd64.deb ...
- Unpacking rustc (1.63.0+dfsg1-2) ...
- Selecting previously unselected package cargo.
- Preparing to unpack .../17-cargo_0.66.0+ds1-1_amd64.deb ...
- Unpacking cargo (0.66.0+ds1-1) ...
- Selecting previously unselected package libarchive13:amd64.
- Preparing to unpack .../18-libarchive13_3.6.2-1+deb12u2_amd64.deb ...
- Unpacking libarchive13:amd64 (3.6.2-1+deb12u2) ...
- Selecting previously unselected package libjsoncpp25:amd64.
- Preparing to unpack .../19-libjsoncpp25_1.9.5-4_amd64.deb ...
- Unpacking libjsoncpp25:amd64 (1.9.5-4) ...
- Selecting previously unselected package librhash0:amd64.
- Preparing to unpack .../20-librhash0_1.4.3-3_amd64.deb ...
- Unpacking librhash0:amd64 (1.4.3-3) ...
- Selecting previously unselected package libuv1:amd64.
- Preparing to unpack .../21-libuv1_1.44.2-1+deb12u1_amd64.deb ...
- Unpacking libuv1:amd64 (1.44.2-1+deb12u1) ...
- Selecting previously unselected package cmake-data.
- Preparing to unpack .../22-cmake-data_3.25.1-1_all.deb ...
- Unpacking cmake-data (3.25.1-1) ...
- Selecting previously unselected package cmake.
- Preparing to unpack .../23-cmake_3.25.1-1_amd64.deb ...
- Unpacking cmake (3.25.1-1) ...
- Selecting previously unselected package icu-devtools.
- Preparing to unpack .../24-icu-devtools_72.1-3_amd64.deb ...
- Unpacking icu-devtools (72.1-3) ...
- Selecting previously unselected package libclang-cpp14.
- Preparing to unpack .../25-libclang-cpp14_1%3a14.0.6-12_amd64.deb ...
- Unpacking libclang-cpp14 (1:14.0.6-12) ...
- Selecting previously unselected package libnspr4:amd64.
- Preparing to unpack .../26-libnspr4_2%3a4.35-1_amd64.deb ...
- Unpacking libnspr4:amd64 (2:4.35-1) ...
- Selecting previously unselected package libnss3:amd64.
- Preparing to unpack .../27-libnss3_2%3a3.87.1-1+deb12u1_amd64.deb ...
- Unpacking libnss3:amd64 (2:3.87.1-1+deb12u1) ...
- Selecting previously unselected package nss-plugin-pem:amd64.
- Preparing to unpack .../28-nss-plugin-pem_1.0.8+1-1_amd64.deb ...
- Unpacking nss-plugin-pem:amd64 (1.0.8+1-1) ...
- Selecting previously unselected package libcurl3-nss:amd64.
- Preparing to unpack .../29-libcurl3-nss_7.88.1-10+deb12u8_amd64.deb ...
- Unpacking libcurl3-nss:amd64 (7.88.1-10+deb12u8) ...
- Selecting previously unselected package libev4:amd64.
- Preparing to unpack .../30-libev4_1%3a4.33-1_amd64.deb ...
- Unpacking libev4:amd64 (1:4.33-1) ...
- Selecting previously unselected package libev-dev:amd64.
- Preparing to unpack .../31-libev-dev_1%3a4.33-1_amd64.deb ...
- Unpacking libev-dev:amd64 (1:4.33-1) ...
- Selecting previously unselected package libffi-dev:amd64.
- Preparing to unpack .../32-libffi-dev_3.4.4-1_amd64.deb ...
- Unpacking libffi-dev:amd64 (3.4.4-1) ...
- Selecting previously unselected package libgmpxx4ldbl:amd64.
- Preparing to unpack .../33-libgmpxx4ldbl_2%3a6.2.1+dfsg1-1.1_amd64.deb ...
- Unpacking libgmpxx4ldbl:amd64 (2:6.2.1+dfsg1-1.1) ...
- Selecting previously unselected package libgmp-dev:amd64.
- Preparing to unpack .../34-libgmp-dev_2%3a6.2.1+dfsg1-1.1_amd64.deb ...
- Unpacking libgmp-dev:amd64 (2:6.2.1+dfsg1-1.1) ...
- Selecting previously unselected package libicu-dev:amd64.
- Preparing to unpack .../35-libicu-dev_72.1-3_amd64.deb ...
- Unpacking libicu-dev:amd64 (72.1-3) ...
- Selecting previously unselected package libncurses6:amd64.
- Preparing to unpack .../36-libncurses6_6.4-4_amd64.deb ...
- Unpacking libncurses6:amd64 (6.4-4) ...
- Selecting previously unselected package libncurses-dev:amd64.
- Preparing to unpack .../37-libncurses-dev_6.4-4_amd64.deb ...
- Unpacking libncurses-dev:amd64 (6.4-4) ...
- Selecting previously unselected package libpfm4:amd64.
- Preparing to unpack .../38-libpfm4_4.13.0-1_amd64.deb ...
- Unpacking libpfm4:amd64 (4.13.0-1) ...
- Selecting previously unselected package libpkgconf3:amd64.
- Preparing to unpack .../39-libpkgconf3_1.8.1-1_amd64.deb ...
- Unpacking libpkgconf3:amd64 (1.8.1-1) ...
- Selecting previously unselected package libtinfo-dev:amd64.
- Preparing to unpack .../40-libtinfo-dev_6.4-4_amd64.deb ...
- Unpacking libtinfo-dev:amd64 (6.4-4) ...
- Selecting previously unselected package libxml2-dev:amd64.
- Preparing to unpack .../41-libxml2-dev_2.9.14+dfsg-1.3~deb12u1_amd64.deb ...
- Unpacking libxml2-dev:amd64 (2.9.14+dfsg-1.3~deb12u1) ...
- Selecting previously unselected package libyaml-0-2:amd64.
- Preparing to unpack .../42-libyaml-0-2_0.2.5-1_amd64.deb ...
- Unpacking libyaml-0-2:amd64 (0.2.5-1) ...
- Selecting previously unselected package libz3-dev:amd64.
- Preparing to unpack .../43-libz3-dev_4.8.12-3.1_amd64.deb ...
- Unpacking libz3-dev:amd64 (4.8.12-3.1) ...
- Selecting previously unselected package llvm-14-runtime.
- Preparing to unpack .../44-llvm-14-runtime_1%3a14.0.6-12_amd64.deb ...
- Unpacking llvm-14-runtime (1:14.0.6-12) ...
- Selecting previously unselected package llvm-14-linker-tools.
- Preparing to unpack .../45-llvm-14-linker-tools_1%3a14.0.6-12_amd64.deb ...
- Unpacking llvm-14-linker-tools (1:14.0.6-12) ...
- Selecting previously unselected package llvm-14.
- Preparing to unpack .../46-llvm-14_1%3a14.0.6-12_amd64.deb ...
- Unpacking llvm-14 (1:14.0.6-12) ...
- Selecting previously unselected package python3-pkg-resources.
- Preparing to unpack .../47-python3-pkg-resources_66.1.1-1+deb12u1_all.deb ...
- Unpacking python3-pkg-resources (66.1.1-1+deb12u1) ...
- Selecting previously unselected package python3-pygments.
- Preparing to unpack .../48-python3-pygments_2.14.0+dfsg-1_all.deb ...
- Unpacking python3-pygments (2.14.0+dfsg-1) ...
- Selecting previously unselected package python3-yaml.
- Preparing to unpack .../49-python3-yaml_6.0-3+b2_amd64.deb ...
- Unpacking python3-yaml (6.0-3+b2) ...
- Selecting previously unselected package llvm-14-tools.
- Preparing to unpack .../50-llvm-14-tools_1%3a14.0.6-12_amd64.deb ...
- Unpacking llvm-14-tools (1:14.0.6-12) ...
- Selecting previously unselected package llvm-14-dev.
- Preparing to unpack .../51-llvm-14-dev_1%3a14.0.6-12_amd64.deb ...
- Unpacking llvm-14-dev (1:14.0.6-12) ...
- Selecting previously unselected package pkgconf-bin.
- Preparing to unpack .../52-pkgconf-bin_1.8.1-1_amd64.deb ...
- Unpacking pkgconf-bin (1.8.1-1) ...
- Selecting previously unselected package pkgconf:amd64.
- Preparing to unpack .../53-pkgconf_1.8.1-1_amd64.deb ...
- Unpacking pkgconf:amd64 (1.8.1-1) ...
- Selecting previously unselected package pkg-config:amd64.
- Preparing to unpack .../54-pkg-config_1.8.1-1_amd64.deb ...
- Unpacking pkg-config:amd64 (1.8.1-1) ...
- Selecting previously unselected package zlib1g-dev:amd64.
- Preparing to unpack .../55-zlib1g-dev_1%3a1.2.13.dfsg-1_amd64.deb ...
- Unpacking zlib1g-dev:amd64 (1:1.2.13.dfsg-1) ...
- Setting up media-types (10.0.0) ...
- Setting up libpipeline1:amd64 (1.5.7-1) ...
- Setting up libicu72:amd64 (72.1-3) ...
- Setting up libyaml-0-2:amd64 (0.2.5-1) ...
- Setting up libev4:amd64 (1:4.33-1) ...
- Setting up libpython3.11-stdlib:amd64 (3.11.2-6+deb12u5) ...
- Setting up m4 (1.4.19-3) ...
- Setting up libffi-dev:amd64 (3.4.4-1) ...
- Setting up autotools-dev (20220109.1) ...
- Setting up libz3-4:amd64 (4.8.12-3.1) ...
- Setting up libpkgconf3:amd64 (1.8.1-1) ...
- Setting up libgmpxx4ldbl:amd64 (2:6.2.1+dfsg1-1.1) ...
- Setting up libuv1:amd64 (1.44.2-1+deb12u1) ...
- Setting up libpfm4:amd64 (4.13.0-1) ...
- Setting up libmbedcrypto7:amd64 (2.28.3-1) ...
- Setting up libnspr4:amd64 (2:4.35-1) ...
- Setting up libncurses6:amd64 (6.4-4) ...
- Setting up binfmt-support (2.2.2-2) ...
- invoke-rc.d: could not determine current runlevel
- invoke-rc.d: policy-rc.d denied execution of start.
- Setting up libjsoncpp25:amd64 (1.9.5-4) ...
- Setting up icu-devtools (72.1-3) ...
- Setting up pkgconf-bin (1.8.1-1) ...
- Setting up autoconf (2.71-3) ...
- Setting up zlib1g-dev:amd64 (1:1.2.13.dfsg-1) ...
- Setting up librhash0:amd64 (1.4.3-3) ...
- Setting up cmake-data (3.25.1-1) ...
- Setting up libev-dev:amd64 (1:4.33-1) ...
- Setting up libicu-dev:amd64 (72.1-3) ...
- Setting up libxml2:amd64 (2.9.14+dfsg-1.3~deb12u1) ...
- Setting up libhttp-parser2.9:amd64 (2.9.4-5) ...
- Setting up libpython3-stdlib:amd64 (3.11.2-1+b1) ...
- Setting up automake (1:1.16.5-1.3) ...
- update-alternatives: using /usr/bin/automake-1.16 to provide /usr/bin/automake (automake) in auto mode
- Setting up libz3-dev:amd64 (4.8.12-3.1) ...
- Setting up python3.11 (3.11.2-6+deb12u5) ...
- Setting up libncurses-dev:amd64 (6.4-4) ...
- Setting up libgmp-dev:amd64 (2:6.2.1+dfsg1-1.1) ...
- Setting up libmbedx509-1:amd64 (2.28.3-1) ...
- Setting up libmbedtls14:amd64 (2.28.3-1) ...
- Setting up libarchive13:amd64 (3.6.2-1+deb12u2) ...
- Setting up python3 (3.11.2-1+b1) ...
- running python rtupdate hooks for python3.11...
- running python post-rtupdate hooks for python3.11...
- Setting up libnss3:amd64 (2:3.87.1-1+deb12u1) ...
- Setting up pkgconf:amd64 (1.8.1-1) ...
- Setting up libxml2-dev:amd64 (2.9.14+dfsg-1.3~deb12u1) ...
- Setting up pkg-config:amd64 (1.8.1-1) ...
- Setting up libllvm14:amd64 (1:14.0.6-12) ...
- Setting up cmake (3.25.1-1) ...
- Setting up llvm-14-linker-tools (1:14.0.6-12) ...
- Setting up libgit2-1.5:amd64 (1.5.1+ds-1+deb12u1) ...
- Setting up python3-pkg-resources (66.1.1-1+deb12u1) ...
- Setting up libtinfo-dev:amd64 (6.4-4) ...
- Setting up libstd-rust-1.63:amd64 (1.63.0+dfsg1-2) ...
- Setting up nss-plugin-pem:amd64 (1.0.8+1-1) ...
- Setting up python3-yaml (6.0-3+b2) ...
- Setting up libstd-rust-dev:amd64 (1.63.0+dfsg1-2) ...
- Setting up python3-pygments (2.14.0+dfsg-1) ...
- Setting up llvm-14-runtime (1:14.0.6-12) ...
- Setting up libclang-cpp14 (1:14.0.6-12) ...
- Setting up rustc (1.63.0+dfsg1-2) ...
- Setting up libcurl3-nss:amd64 (7.88.1-10+deb12u8) ...
- Setting up llvm-14 (1:14.0.6-12) ...
- Setting up llvm-14-tools (1:14.0.6-12) ...
- Setting up cargo (0.66.0+ds1-1) ...
- Setting up llvm-14-dev (1:14.0.6-12) ...
- Processing triggers for libc-bin (2.36-9+deb12u9) ...

<><> Processing actions <><><><><><><><><><><><><><><><><><><><><><><><><><><><>
-> retrieved aches.1.1.0, aches-lwt.1.1.0, ringo.1.1.0  (cached)
-> retrieved alcotest.1.8.0  (cached)
-> retrieved angstrom.0.16.1  (cached)
-> retrieved asetmap.0.8.1  (cached)
-> retrieved asn1-combinators.0.3.2  (cached)
-> installed base-bytes.base
-> retrieved astring.0.8.5  (cached)
-> retrieved base.v0.16.3  (cached)
-> retrieved base64.3.5.1  (cached)
-> retrieved bheap.2.0.0  (cached)
-> retrieved bigarray-compat.1.1.0  (cached)
-> installed ringo.1.1.0
-> retrieved bigstring.0.3  (cached)
-> installed base64.3.5.1
-> retrieved bigstringaf.0.10.0  (cached)
-> installed bheap.2.0.0
-> retrieved bos.0.2.1  (cached)
-> retrieved ca-certs.1.0.0  (cached)
-> retrieved camlp-streams.5.0.1  (cached)
-> retrieved camlzip.1.11  (cached)
-> retrieved checkseum.0.5.2  (cached)
-> retrieved clap.0.3.0  (cached)
-> retrieved class_group_vdf.0.0.5  (cached)
-> retrieved cmdliner.1.3.0  (cached)
-> retrieved cohttp.5.3.1  (cached)
-> installed bigstring.0.3
-> retrieved cohttp-lwt.5.3.0, cohttp-lwt-unix.5.3.0  (cached)
-> retrieved conf-cmake.1  (cached)
-> retrieved conf-gmp.4  (cached)
-> retrieved conf-gmp-powm-sec.3  (cached)
-> retrieved conf-libev.4-12  (cached)
-> retrieved conf-rust-2021.1  (cached)
-> installed bigarray-compat.1.1.0
-> retrieved conduit.7.1.0, conduit-lwt.7.1.0, conduit-lwt-unix.7.1.0  (cached)
-> installed aches.1.1.0
-> installed camlp-streams.5.0.1
-> installed clap.0.3.0
-> retrieved cppo.1.8.0  (cached)
-> installed conf-autoconf.0.2
-> installed conf-bash.1
-> installed conf-cmake.1
-> installed conf-g++.1.0
-> installed conf-gmp.4
-> installed conf-pkg-config.4
-> installed conf-which.1
-> retrieved csexp.1.5.2  (cached)
-> retrieved cstruct.6.2.0, cstruct-lwt.6.2.0  (cached)
-> installed conf-libev.4-12
-> installed conf-gmp-powm-sec.3
-> installed conf-libffi.2.0.0
-> installed conf-zlib.1
-> installed conf-rust.0.1
-> retrieved ctypes.0.23.0, ctypes-foreign.0.23.0  (cached)
-> retrieved ctypes_stubs_js.0.1  (cached)
-> retrieved data-encoding.1.0.1, json-data-encoding.1.0.1, json-data-encoding-bson.1.0.1  (cached)
-> installed conf-rust-2021.1
-> installed csexp.1.5.2
-> retrieved decompress.1.5.3  (cached)
-> retrieved domain-name.0.4.0  (cached)
-> retrieved digestif.1.2.0  (cached)
-> retrieved dune-configurator.3.17.2  (cached)
-> installed camlzip.1.11
-> retrieved duration.0.2.1  (cached)
-> retrieved either.1.0.0  (cached)
-> retrieved eqaf.0.10  (cached)
-> retrieved ezjsonm.1.3.0  (cached)
-> retrieved fmt.0.9.0  (cached)
-> retrieved fpath.0.7.3  (cached)
-> retrieved gen.1.1  (cached)
-> retrieved gmap.0.3.0  (cached)
-> retrieved hashcons.1.4.0  (cached)
-> retrieved hex.1.5.0  (cached)
-> retrieved index.1.6.2  (cached)
-> retrieved hacl-star.0.7.2, hacl-star-raw.0.7.2  (cached)
-> installed cmdliner.1.3.0
-> installed cppo.1.8.0
-> installed domain-name.0.4.0
-> installed duration.0.2.1
-> installed either.1.0.0
-> installed gmap.0.3.0
-> installed hashcons.1.4.0
-> retrieved integers.0.7.0  (cached)
-> retrieved integers_stubs_js.1.0  (cached)
-> retrieved jane-street-headers.v0.16.0  (cached)
-> retrieved ipaddr.5.6.0, ipaddr-sexp.5.6.0, macaddr.5.6.0  (cached)
-> retrieved jsonm.1.0.2  (cached)
-> retrieved jst-config.v0.16.0  (cached)
-> retrieved kdf.1.0.0  (cached)
-> retrieved logs.0.7.0  (cached)
-> retrieved lru.0.3.1  (cached)
-> retrieved lwt.5.9.0  (cached)
-> installed eqaf.0.10
-> installed jane-street-headers.v0.16.0
-> retrieved lwt-canceler.0.3  (cached)
-> retrieved lwt-exit.1.0  (cached)
-> retrieved lwt-watcher.0.2  (cached)
-> retrieved magic-mime.1.3.1  (cached)
-> installed macaddr.5.6.0
-> retrieved menhir.20240715, menhirCST.20240715, menhirLib.20240715, menhirSdk.20240715  (cached)
-> retrieved js_of_ocaml.5.9.1, js_of_ocaml-compiler.5.9.1  (cached)
-> installed dune-configurator.3.17.2
-> installed digestif.1.2.0
-> installed magic-mime.1.3.1
-> installed ipaddr.5.6.0
-> retrieved mirage-crypto.1.2.0, mirage-crypto-ec.1.2.0, mirage-crypto-pk.1.2.0, mirage-crypto-rng.1.2.0  (cached)
-> installed menhirCST.20240715
-> installed menhirLib.20240715
-> installed menhirSdk.20240715
-> retrieved mtime.2.1.0  (cached)
-> retrieved ocaml-compiler-libs.v0.12.4  (cached)
-> retrieved ocaml-syntax-shims.1.0.0  (cached)
-> retrieved ocamlbuild.0.15.0  (cached)
-> retrieved ocaml-migrate-parsetree.2.4.0  (cached)
-> retrieved ocp-ocamlres.0.4  (cached)
-> retrieved ocamlgraph.2.1.0  (cached)
-> installed bigstringaf.0.10.0
-> retrieved ocplib-endian.1.2  (cached)
-> installed ocaml-syntax-shims.1.0.0
-> installed ocaml-compiler-libs.v0.12.4
-> installed ocplib-endian.1.2
-> installed angstrom.0.16.1
-> installed ocaml-migrate-parsetree.2.4.0
-> installed mirage-crypto.1.2.0
-> retrieved bls12-381.20.1  (cached)
-> installed ocamlbuild.0.15.0
-> installed kdf.1.0.0
-> installed lwt.5.9.0
-> installed lwt-watcher.0.2
-> installed lwt-canceler.0.3
-> installed aches-lwt.1.1.0
-> retrieved octez-crawler.20.1  (cached)
-> installed menhir.20240715
-> retrieved octez-alcotezt.20.1  (cached)
-> retrieved octez-distributed-internal.20.1  (cached)
-> retrieved octez-distributed-lwt-internal.20.1  (cached)
-> retrieved octez-injector.20.1  (cached)
-> retrieved octez-internal-libs.20.1  (cached)
-> installed octez-distributed-internal.20.1
-> retrieved octez-l2-libs.20.1  (cached)
-> retrieved octez-libs.20.1  (cached)
-> retrieved octez-node-config.20.1  (cached)
-> retrieved octez-proto-libs.20.1  (cached)
-> retrieved octez-protocol-017-PtNairob-libs.20.1  (cached)
-> retrieved octez-protocol-compiler.20.1  (cached)
-> retrieved octez-shell-libs.20.1  (cached)
-> retrieved octez-smart-rollup-node-lib.20.1  (cached)
-> retrieved ohex.0.2.0  (cached)
-> retrieved optint.0.3.0  (cached)
-> retrieved pprint.20230830  (cached)
-> retrieved ppx_assert.v0.16.0  (cached)
-> retrieved ppx_base.v0.16.0  (cached)
-> retrieved ppx_cold.v0.16.0  (cached)
-> retrieved ppx_compare.v0.16.0  (cached)
-> retrieved ppx_derivers.1.2.1  (cached)
-> retrieved ppx_deriving.6.0.3  (cached)
-> retrieved ppx_enumerate.v0.16.0  (cached)
-> retrieved ppx_expect.v0.16.1  (cached)
-> retrieved ppx_globalize.v0.16.0  (cached)
-> retrieved ppx_hash.v0.16.0  (cached)
-> retrieved ppx_here.v0.16.0  (cached)
-> retrieved ppx_import.1.11.0  (cached)
-> retrieved ppx_inline_test.v0.16.1  (cached)
-> retrieved ppx_optcomp.v0.16.0  (cached)
-> retrieved octez-smart-rollup-node-PtNairob.20.1  (cached)
-> installed ohex.0.2.0
-> installed optint.0.3.0
-> installed pprint.20230830
-> installed ppx_derivers.1.2.1
-> retrieved ppx_repr.0.7.0, repr.0.7.0  (cached)
-> retrieved ppx_sexp_conv.v0.16.0  (cached)
-> retrieved prbnmcn-basic-structures.0.0.1  (cached)
-> retrieved prbnmcn-linalg.0.0.1  (cached)
-> retrieved prbnmcn-stats.0.0.6  (cached)
-> retrieved pringo.1.3  (cached)
-> retrieved ppxlib.0.35.0  (cached)
-> retrieved prometheus.1.2, prometheus-app.1.2  (cached)
-> retrieved progress.0.4.0, terminal.0.4.0  (cached)
-> retrieved psq.0.2.1  (cached)
-> retrieved ptime.1.2.0  (cached)
-> retrieved pure-splitmix.0.3  (cached)
-> retrieved pyml.20231101  (cached)
-> retrieved qcheck-alcotest.0.23, qcheck-core.0.23  (cached)
-> retrieved re.1.12.0  (cached)
-> retrieved resto.1.2, resto-acl.1.2, resto-cohttp.1.2, resto-cohttp-client.1.2, resto-cohttp-self-serving-client.1.2, resto-cohttp-server.1.2, resto-directory.1.2  (cached)
-> retrieved rresult.0.7.0  (cached)
-> retrieved rusage.1.0.0  (cached)
-> retrieved sedlex.3.3  (cached)
-> retrieved secp256k1-internal.0.4.0  (cached)
-> retrieved seq.base  (cached)
-> installed seq.base
-> installed pure-splitmix.0.3
-> retrieved semaphore-compat.1.0.2  (cached)
-> retrieved seqes.0.3  (cached)
-> retrieved sexplib0.v0.16.0  (cached)
-> retrieved stdint.0.7.2  (cached)
-> retrieved stdcompat.19  (cached)
-> installed checkseum.0.5.2
-> retrieved stdio.v0.16.0  (cached)
-> retrieved stdlib-random.1.2.0  (cached)
-> installed pringo.1.3
-> installed psq.0.2.1
-> installed rusage.1.0.0
-> installed semaphore-compat.1.0.2
-> retrieved stdlib-shims.0.3.0  (cached)
-> retrieved stringext.1.6.0  (cached)
-> installed sexplib0.v0.16.0
-> retrieved tar.2.6.0, tar-unix.2.6.0  (cached)
-> installed gen.1.1
-> installed seqes.0.3
-> installed stdlib-random.1.2.0
-> installed lru.0.3.1
-> installed stdlib-shims.0.3.0
-> installed stringext.1.6.0
-> installed re.1.12.0
-> installed stdint.0.7.2
-> installed qcheck-core.0.23
-> installed integers.0.7.0
-> installed decompress.1.5.3
-> retrieved octez-version.20.1  (cached)
-> installed ocamlgraph.2.1.0
-> installed ctypes.0.23.0
-> installed base.v0.16.3
-> installed stdio.v0.16.0
-> installed ctypes-foreign.0.23.0
-> installed stdcompat.19
-> retrieved tezos-dac-client-lib.20.1  (cached)
-> retrieved tezos-benchmark.20.1  (cached)
-> retrieved tezos-dac-lib.20.1  (cached)
-> installed ppxlib.0.35.0
-> installed pyml.20231101
-> installed ppx_globalize.v0.16.0
-> installed ppx_optcomp.v0.16.0
-> installed ppx_cold.v0.16.0
-> installed ppx_enumerate.v0.16.0
-> installed ppx_here.v0.16.0
-> installed ppx_compare.v0.16.0
-> installed ppx_import.1.11.0
-> retrieved tezos-dal-node-lib.20.1  (cached)
-> retrieved tezos-dal-node-services.20.1  (cached)
-> retrieved tezos-openapi.20.1  (cached)
-> installed ppx_deriving.6.0.3
-> installed ppx_sexp_conv.v0.16.0
-> installed sedlex.3.3
-> retrieved tezos-rust-libs.1.6  (cached)
-> retrieved tezos-protocol-017-PtNairob.20.1  (cached)
-> retrieved tezos-sapling-parameters.1.1.0  (cached)
-> installed tezos-sapling-parameters.1.1.0
-> installed ipaddr-sexp.5.6.0
-> installed ppx_assert.v0.16.0
-> installed ppx_hash.v0.16.0
-> retrieved tezt.4.2.0  (cached)
-> retrieved time_now.v0.16.0  (cached)
-> retrieved topkg.1.0.7  (cached)
-> retrieved uutf.1.0.3  (cached)
-> retrieved uri.4.4.0, uri-sexp.4.4.0  (cached)
-> retrieved vector.1.0.0  (cached)
-> retrieved yaml.3.2.0  (cached)
-> retrieved x509.1.0.5  (cached)
-> retrieved uucp.16.0.0  (cached)
-> retrieved yojson.2.2.2  (cached)
-> installed vector.1.0.0
-> retrieved zarith.1.13  (cached)
-> retrieved zarith_stubs_js.v0.16.1  (cached)
-> installed zarith_stubs_js.v0.16.1
-> installed ppx_base.v0.16.0
-> installed yojson.2.2.2
-> installed jst-config.v0.16.0
-> installed uri.4.4.0
-> installed resto.1.2
-> installed resto-acl.1.2
-> installed resto-directory.1.2
-> installed zarith.1.13
-> installed uri-sexp.4.4.0
-> installed time_now.v0.16.0
-> installed topkg.1.0.7
-> installed prbnmcn-basic-structures.0.0.1
-> installed asetmap.0.8.1
-> installed rresult.0.7.0
-> installed prbnmcn-stats.0.0.6
-> installed uutf.1.0.3
-> installed prbnmcn-linalg.0.0.1
-> installed mtime.2.1.0
-> installed fmt.0.9.0
-> installed ptime.1.2.0
-> installed astring.0.8.5
-> installed lwt-exit.1.0
-> installed prometheus.1.2
-> installed cstruct.6.2.0
-> installed asn1-combinators.0.3.2
-> installed hex.1.5.0
-> installed cstruct-lwt.6.2.0
-> installed jsonm.1.0.2
-> installed ppx_inline_test.v0.16.1
-> installed fpath.0.7.3
-> installed tar.2.6.0
-> installed ezjsonm.1.3.0
-> installed alcotest.1.8.0
-> installed qcheck-alcotest.0.23
-> installed ocp-ocamlres.0.4
-> installed repr.0.7.0
-> installed tar-unix.2.6.0
-> installed json-data-encoding.1.0.1
-> installed json-data-encoding-bson.1.0.1
-> installed cohttp.5.3.1
-> installed class_group_vdf.0.0.5
-> installed ppx_expect.v0.16.1
-> installed ppx_repr.0.7.0
-> installed secp256k1-internal.0.4.0
-> installed data-encoding.1.0.1
-> installed js_of_ocaml-compiler.5.9.1
-> installed uucp.16.0.0
-> installed terminal.0.4.0
-> installed js_of_ocaml.5.9.1
-> installed integers_stubs_js.1.0
-> installed logs.0.7.0
-> installed tezt.4.2.0
-> installed ctypes_stubs_js.0.1
-> installed bos.0.2.1
-> installed cohttp-lwt.5.3.0
-> installed conduit.7.1.0
-> installed mirage-crypto-rng.1.2.0
-> installed progress.0.4.0
-> installed resto-cohttp.1.2
-> installed mirage-crypto-pk.1.2.0
-> installed resto-cohttp-client.1.2
-> installed conduit-lwt.7.1.0
-> installed octez-distributed-lwt-internal.20.1
-> installed octez-alcotezt.20.1
-> installed index.1.6.2
-> installed bls12-381.20.1
-> installed yaml.3.2.0
-> installed tezos-openapi.20.1
-> installed mirage-crypto-ec.1.2.0
-> installed x509.1.0.5
-> installed ca-certs.1.0.0
-> installed conduit-lwt-unix.7.1.0
-> installed cohttp-lwt-unix.5.3.0
-> installed prometheus-app.1.2
-> installed resto-cohttp-server.1.2
-> installed resto-cohttp-self-serving-client.1.2
[ERROR] The compilation of octez-internal-libs.20.1 failed at "dune build -p octez-internal-libs -j 71".
[ERROR] The compilation of tezos-rust-libs.1.6 failed at "cargo build --target-dir target-librustzcash --release --package librustzcash".
[ERROR] The compilation of hacl-star-raw.0.7.2 failed at "make -C hacl-star-raw build-c".

#=== ERROR while compiling tezos-rust-libs.1.6 ================================#
# context              2.3.0 | linux/x86_64 | ocaml-base-compiler.4.14.2 | file:///src
# path                 ~/.opam/4.14/.opam-switch/build/tezos-rust-libs.1.6
# command              /usr/bin/cargo build --target-dir target-librustzcash --release --package librustzcash
# exit-code            101
# env-file             ~/.opam/log/tezos-rust-libs-113-6030cb.env
# output-file          ~/.opam/log/tezos-rust-libs-113-6030cb.out
### output ###
# warning: profiles for the non root package will be ignored, specify profiles at the workspace root:
# package:   /home/opam/.opam/4.14/.opam-switch/build/tezos-rust-libs.1.6/librustzcash/Cargo.toml
# workspace: /home/opam/.opam/4.14/.opam-switch/build/tezos-rust-libs.1.6/Cargo.toml
#    Compiling libc v0.2.139
#    Compiling cfg-if v1.0.0
#    Compiling version_check v0.9.4
#    Compiling autocfg v1.1.0
#    Compiling proc-macro2 v1.0.50
#    Compiling quote v1.0.23
#    Compiling unicode-ident v1.0.6
#    Compiling syn v1.0.107
#    Compiling typenum v1.16.0
#    Compiling memchr v2.5.0
#    Compiling subtle v2.4.1
#    Compiling once_cell v1.17.0
#    Compiling crossbeam-utils v0.8.14
#    Compiling arrayvec v0.7.2
#    Compiling radium v0.7.0
#    Compiling tap v1.0.1
#    Compiling constant_time_eq v0.1.5
#    Compiling arrayref v0.3.6
#    Compiling byteorder v1.4.3
#    Compiling funty v2.0.0
#    Compiling scopeguard v1.1.0
#    Compiling unicode-xid v0.2.4
#    Compiling ppv-lite86 v0.2.17
#    Compiling serde_derive v1.0.152
#    Compiling cc v1.0.79
#    Compiling cpufeatures v0.2.5
#    Compiling serde v1.0.152
#    Compiling opaque-debug v0.3.0
#    Compiling lazy_static v1.4.0
#    Compiling static_assertions v1.1.0
#    Compiling log v0.4.17
#    Compiling rayon-core v1.10.2
#    Compiling crunchy v0.2.2
#    Compiling either v1.8.1
#    Compiling pin-project-lite v0.2.9
#    Compiling hex v0.4.3
#    Compiling thiserror v1.0.38
#    Compiling siphasher v0.3.10
#    Compiling toml_datetime v0.5.1
#    Compiling itoa v1.0.5
#    Compiling nonempty v0.7.0
#    Compiling libm v0.2.6
#    Compiling smallvec v1.10.0
#    Compiling fnv v1.0.7
#    Compiling futures-core v0.3.26
#    Compiling bitflags v1.3.2
#    Compiling regex-syntax v0.6.28
#    Compiling base64ct v1.0.1
#    Compiling block-padding v0.2.1
#    Compiling parking_lot_core v0.8.6
#    Compiling tinyvec_macros v0.1.0
#    Compiling futures-task v0.3.26
#    Compiling spin v0.5.2
#    Compiling time-core v0.1.0
#    Compiling futures-channel v0.3.26
#    Compiling bytes v1.4.0
#    Compiling byte-slice-cast v1.2.2
#    Compiling metrics v0.17.1
#    Compiling httparse v1.8.0
#    Compiling arrayvec v0.5.2
#    Compiling futures-util v0.3.26
#    Compiling untrusted v0.7.1
#    Compiling try-lock v0.2.4
#    Compiling overload v0.1.1
#    Compiling endian-type v0.1.2
#    Compiling rustc-hex v2.1.0
#    Compiling pin-utils v0.1.0
#    Compiling instant v0.1.12
#    Compiling anyhow v1.0.68
#    Compiling tinyvec v1.6.0
#    Compiling nu-ansi-term v0.46.0
#    Compiling rand_core v0.5.1
#    Compiling httpdate v1.0.2
#    Compiling sharded-slab v0.1.4
#    Compiling sketches-ddsketch v0.1.3
#    Compiling gimli v0.27.1
#    Compiling time-macros v0.2.6
#    Compiling raw-cpuid v10.6.0
#    Compiling atomic-shim v0.2.0
#    Compiling tower-service v0.3.2
#    Compiling adler v1.0.2
#    Compiling rustc-demangle v0.1.21
#    Compiling bech32 v0.8.1
#    Compiling ipnet v2.7.1
#    Compiling wyz v0.5.1
#    Compiling memuse v0.2.1
#    Compiling miniz_oxide v0.6.2
#    Compiling phf_shared v0.11.1
#    Compiling tracing-core v0.1.30
#    Compiling thread_local v1.1.4
#    Compiling zcash_encoding v0.1.0
#    Compiling generic-array v0.14.6
#    Compiling ahash v0.7.6
#    Compiling nom v5.1.2
#    Compiling memoffset v0.7.1
#    Compiling crossbeam-epoch v0.9.13
#    Compiling indexmap v1.9.3
#    Compiling num-traits v0.2.15
#    Compiling num-integer v0.1.45
#    Compiling num-bigint v0.4.3
#    Compiling lock_api v0.4.9
#    Compiling tokio v1.25.0
#    Compiling blake2b_simd v1.0.0
#    Compiling blake2s_simd v1.0.0
#    Compiling nibble_vec v0.1.0
#    Compiling blake2b_simd v0.5.11
#    Compiling phf v0.11.1
#    Compiling radix_trie v0.2.1
#    Compiling uint v0.9.5
#    Compiling want v0.3.0
#    Compiling bitvec v1.0.1
#    Compiling http v0.2.8
#    Compiling aho-corasick v0.7.20
#    Compiling object v0.30.3
#    Compiling crossbeam-channel v0.5.6
#    Compiling nom8 v0.2.0
#    Compiling f4jumble v0.1.0
#    Compiling equihash v0.1.0
#    Compiling secp256k1-sys v0.4.2
#    Compiling ring v0.16.20
#    Compiling backtrace v0.3.67
#    Compiling crossbeam-deque v0.8.2
#    Compiling time v0.3.17
#    Compiling unicode-normalization v0.1.22
#    Compiling http-body v0.4.5
#    Compiling ordered-float v2.10.0
#    Compiling getrandom v0.2.8
#    Compiling rand_core v0.6.4
#    Compiling digest v0.9.0
#    Compiling cipher v0.3.0
#    Compiling block-buffer v0.9.0
#    Compiling universal-hash v0.4.1
#    Compiling aead v0.4.3
#    Compiling crypto-mac v0.11.1
#    Compiling block-buffer v0.10.3
#    Compiling crypto-common v0.1.6
#    Compiling num_cpus v1.15.0
#    Compiling dirs-sys v0.3.7
#    Compiling mio v0.8.5
#    Compiling socket2 v0.4.7
#    Compiling quanta v0.9.3
#    Compiling which v4.4.0
#    Compiling nix v0.24.3
#    Compiling poly1305 v0.7.2
#    Compiling sha2 v0.9.9
#    Compiling hmac v0.11.0
#    Compiling dirs v4.0.0
#    Compiling directories v4.0.1
#    Compiling regex-automata v0.1.10
#    Compiling regex v1.7.1
#    Compiling rand_chacha v0.3.1
#    Compiling digest v0.10.6
#    Compiling block-modes v0.8.1
#    Compiling aes v0.7.5
#    Compiling dashmap v4.0.2
#    Compiling hashbrown v0.12.3
#    Compiling password-hash v0.3.2
#    Compiling parking_lot v0.11.2
#    Compiling ripemd v0.1.3
#    Compiling bs58 v0.4.0
#    Compiling rand v0.8.5
#    Compiling hashbrown v0.11.2
#    Compiling zcash_address v0.1.0
#    Compiling pbkdf2 v0.9.0
#    Compiling rayon v1.6.1
#    Compiling matchers v0.1.0
#    Compiling addr2line v0.19.0
#    Compiling fpe v0.5.1
#    Compiling phf_generator v0.11.1
#    Compiling fixed-hash v0.7.0
#    Compiling phf_codegen v0.11.1
#    Compiling terminfo v0.7.5
#    Compiling ff v0.12.1
#    Compiling group v0.12.1
#    Compiling toml_edit v0.18.1
#    Compiling pairing v0.22.0
#    Compiling pasta_curves v0.4.1
#    Compiling bls12_381 v0.7.1
#    Compiling secp256k1 v0.21.3
#    Compiling jubjub v0.9.0
#    Compiling proc-macro-crate v1.3.0
#    Compiling halo2_proofs v0.1.0
#    Compiling bellman v0.13.1
#    Compiling hdwallet v0.3.1
#    Compiling synstructure v0.12.6
#    Compiling zeroize_derive v1.3.3
#    Compiling thiserror-impl v1.0.38
#    Compiling tracing-attributes v0.1.23
#    Compiling parity-scale-codec-derive v3.1.4
#    Compiling impl-trait-for-tuples v0.2.2
#    Compiling tokio-macros v1.8.2
#    Compiling metrics-macros v0.4.1
#    Compiling gumdrop_derive v0.8.1
#    Compiling zeroize v1.5.7
#    Compiling chacha20 v0.8.2
#    Compiling bip0039 v0.9.0
#    Compiling curve25519-dalek v3.2.0
#    Compiling secrecy v0.8.0
#    Compiling metrics-util v0.10.2
#    Compiling chacha20poly1305 v0.9.1
#    Compiling zcash_note_encryption v0.1.0
#    Compiling tracing v0.1.37
#    Compiling clearscreen v1.0.11
#    Compiling tracing-subscriber v0.3.16
#    Compiling halo2_gadgets v0.1.0
#    Compiling gumdrop v0.8.1
#    Compiling tracing-appender v0.2.2
#    Compiling hyper v0.14.23
#    Compiling metrics-exporter-prometheus v0.6.1
#    Compiling reddsa v0.3.0
#    Compiling parity-scale-codec v3.3.0
#    Compiling incrementalmerkletree v0.3.0
#    Compiling ed25519-zebra v3.1.0
#    Compiling orchard v0.1.0
#    Compiling impl-codec v0.6.0
#    Compiling primitive-types v0.11.1
#    Compiling zcash_history v0.3.0
#    Compiling zcash_primitives v0.6.0
#    Compiling zcash_proofs v0.6.0
#    Compiling librustzcash v0.2.0 (/home/opam/.opam/4.14/.opam-switch/build/tezos-rust-libs.1.6/librustzcash)
# LLVM ERROR: IO failure on output stream: No space left on device
# error: could not compile `librustzcash`


#=== ERROR while compiling octez-internal-libs.20.1 ===========================#
# context              2.3.0 | linux/x86_64 | ocaml-base-compiler.4.14.2 | file:///src
# path                 ~/.opam/4.14/.opam-switch/build/octez-internal-libs.20.1
# command              ~/.opam/4.14/bin/dune build -p octez-internal-libs -j 71
# exit-code            2
# env-file             ~/.opam/log/octez-internal-libs-113-80eec0.env
# output-file          ~/.opam/log/octez-internal-libs-113-80eec0.out
### output ###
# File "irmin/lib_irmin_pack/unix/.irmin_pack_unix.objs/native/_unknown_", line 1, characters 0-0:
# (cd _build/default && /home/opam/.opam/4.14/bin/ocamlopt.opt -w -40 -w -66-68 -g -O3 -I irmin/lib_irmin_pack/unix/.irmin_pack_unix.objs/byte -I irmin/lib_irmin_pack/unix/.irmin_pack_unix.objs/native -I /home/opam/.opam/4.14/lib/angstrom -I /home/opam/.opam/4.14/lib/astring -I /home/opam/.opam/4.14/lib/base64 -I /home/opam/.opam/4.14/lib/bheap -I /home/opam/.opam/4.14/lib/bigstringaf -I /home/opam/.opam/4.14/lib/bytes -I /home/opam/.opam/4.14/lib/checkseum -I /home/opam/.opam/4.14/lib/checkseum/ocaml -I /home/opam/.opam/4.14/lib/cmdliner -I /home/opam/.opam/4.14/lib/digestif -I /home/opam/.opam/4.14/lib/either -I /home/opam/.opam/4.14/lib/eqaf -I /home/opam/.opam/4.14/lib/fmt -I /home/opam/.opam/4.14/lib/index -I /home/opam/.opam/4.14/lib/index/unix -I /home/opam/.opam/4.14/lib/jsonm -I /home/opam/.opam/4.14/lib/logs -I /home/opam/.opam/4.14/lib/lru -I /home/opam/.opam/4.14/lib/lwt -I /home/opam/.opam/4.14/lib/lwt/unix -I /home/opam/.opam/4.14/lib/mtime -I /home/opam/.opam/4.14/lib/mtime/clock -I /home/opam/.opam/4.14/lib/ocaml-compiler-libs/common -I /home/opam/.opam/4.14/lib/ocaml-compiler-libs/shadow -I /home/opam/.opam/4.14/lib/ocaml/compiler-libs -I /home/opam/.opam/4.14/lib/ocaml/threads -I /home/opam/.opam/4.14/lib/ocamlgraph -I /home/opam/.opam/4.14/lib/ocplib-endian -I /home/opam/.opam/4.14/lib/ocplib-endian/bigstring -I /home/opam/.opam/4.14/lib/optint -I /home/opam/.opam/4.14/lib/ppx_derivers -I /home/opam/.opam/4.14/lib/ppx_repr -I /home/opam/.opam/4.14/lib/ppx_repr/lib -I /home/opam/.opam/4.14/lib/ppxlib -I /home/opam/.opam/4.14/lib/ppxlib/ast -I /home/opam/.opam/4.14/lib/ppxlib/astlib -I /home/opam/.opam/4.14/lib/ppxlib/print_diff -I /home/opam/.opam/4.14/lib/ppxlib/stdppx -I /home/opam/.opam/4.14/lib/ppxlib/traverse_builtins -I /home/opam/.opam/4.14/lib/progress -I /home/opam/.opam/4.14/lib/progress/engine -I /home/opam/.opam/4.14/lib/psq -I /home/opam/.opam/4.14/lib/repr -I /home/opam/.opam/4.14/lib/rusage -I /home/opam/.opam/4.14/lib/semaphore-compat -I /home/opam/.opam/4.14/lib/seq -I /home/opam/.opam/4.14/lib/sexplib0 -I /home/opam/.opam/4.14/lib/stdlib-shims -I /home/opam/.opam/4.14/lib/stringext -I /home/opam/.opam/4.14/lib/terminal -I /home/opam/.opam/4.14/lib/terminal/ansi -I /home/opam/.opam/4.14/lib/uri -I /home/opam/.opam/4.14/lib/uucp -I /home/opam/.opam/4.14/lib/uutf -I /home/opam/.opam/4.14/lib/vector -I irmin/lib_irmin/.irmin.objs/byte -I irmin/lib_irmin/.irmin.objs/native -I irmin/lib_irmin/data/.irmin_data.objs/byte -I irmin/lib_irmin/data/.irmin_data.objs/native -I irmin/lib_irmin_pack/.irmin_pack.objs/byte -I irmin/lib_irmin_pack/.irmin_pack.objs/native -I irmin/lib_ppx_irmin/internal/.ppx_irmin_internal_lib.objs/byte -I irmin/lib_ppx_irmin/internal/.ppx_irmin_internal_lib.objs/native -intf-suffix .ml -no-alias-deps -open Irmin_pack_unix__ -o irmin/lib_irmin_pack/unix/.irmin_pack_unix.objs/native/irmin_pack_unix__File_manager.cmx -c -impl irmin/lib_irmin_pack/unix/file_manager.pp.ml)
# Command exited with code 2.
# Fatal error: exception Sys_error("No space left on device")
# Raised by primitive operation at Stdlib.close_out in file "stdlib.ml", line 392, characters 19-27
# Called from Stdune__Exn.protectx in file "otherlibs/stdune/src/exn.ml", line 15, characters 4-13
# Called from Stdune__Exn.protectx in file "otherlibs/stdune/src/exn.ml", line 10, characters 8-11
# Re-raised at Stdune__Exn.protectx in file "otherlibs/stdune/src/exn.ml", line 16, characters 4-11
# Called from Stdlib.at_exit.new_exit in file "stdlib.ml", line 560, characters 59-63
# Called from Stdlib.do_at_exit in file "stdlib.ml" (inlined), line 566, characters 20-61
# Called from Stdlib.exit in file "stdlib.ml", line 569, characters 2-15
# Called from Main in file "bin/main.ml", line 116, characters 4-24


#=== ERROR while compiling hacl-star-raw.0.7.2 ================================#
# context              2.3.0 | linux/x86_64 | ocaml-base-compiler.4.14.2 | file:///src
# path                 ~/.opam/4.14/.opam-switch/build/hacl-star-raw.0.7.2
# command              /usr/bin/make -C hacl-star-raw build-c
# exit-code            2
# env-file             ~/.opam/log/hacl-star-raw-113-942170.env
# output-file          ~/.opam/log/hacl-star-raw-113-942170.out
### output ###
# make: Entering directory '/home/opam/.opam/4.14/.opam-switch/build/hacl-star-raw.0.7.2/hacl-star-raw'
# ocamlfind dep -I lib -slash lib/EverCrypt_AEAD_bindings.ml lib/EverCrypt_AutoConfig2_bindings.ml lib/EverCrypt_Chacha20Poly1305_bindings.ml lib/EverCrypt_Cipher_bindings.ml lib/EverCrypt_Curve25519_bindings.ml lib/EverCrypt_DRBG_bindings.ml lib/EverCrypt_Ed25519_bindings.ml lib/EverCrypt_Error_bindings.ml lib/EverCrypt_HKDF_bindings.ml lib/EverCrypt_HMAC_bindings.ml lib/EverCrypt_Hash_bindings.ml lib/EverCrypt_Poly1305_bindings.ml lib/Hacl_Bignum25519_51_bindings.ml lib/Hacl_Bignum256_32_bindings.ml lib/Hacl_Bignum256_bindings.ml lib/Hacl_Bignum32_bindings.ml lib/Hacl_Bignum4096_32_bindings.ml lib/Hacl_Bignum4096_bindings.ml lib/Hacl_Bignum64_bindings.ml lib/Hacl_Bignum_Base_bindings.ml lib/Hacl_Bignum_K256_bindings.ml lib/Hacl_Bignum_bindings.ml lib/Hacl_Chacha20Poly1305_128_bindings.ml lib/Hacl_Chacha20Poly1305_256_bindings.ml lib/Hacl_Chacha20Poly1305_32_bindings.ml lib/Hacl_Chacha20_Vec128_bindings.ml lib/Hacl_Chacha20_Vec256_bindings.ml lib/Hacl_Chacha20_Vec32_bindings.ml lib/Hacl_Chacha20_bindings.ml lib/Hacl_Curve25519_51_bindings.ml lib/Hacl_Curve25519_64_bindings.ml lib/Hacl_EC_Ed25519_bindings.ml lib/Hacl_EC_K256_bindings.ml lib/Hacl_Ed25519_bindings.ml lib/Hacl_FFDHE_bindings.ml lib/Hacl_Frodo1344_bindings.ml lib/Hacl_Frodo640_bindings.ml lib/Hacl_Frodo64_bindings.ml lib/Hacl_Frodo976_bindings.ml lib/Hacl_Frodo_KEM_bindings.ml lib/Hacl_GenericField32_bindings.ml lib/Hacl_GenericField64_bindings.ml lib/Hacl_HKDF_Blake2b_256_bindings.ml lib/Hacl_HKDF_Blake2s_128_bindings.ml lib/Hacl_HKDF_bindings.ml lib/Hacl_HMAC_Blake2b_256_bindings.ml lib/Hacl_HMAC_Blake2s_128_bindings.ml lib/Hacl_HMAC_DRBG_bindings.ml lib/Hacl_HMAC_bindings.ml lib/Hacl_HPKE_Curve51_CP128_SHA256_bindings.ml lib/Hacl_HPKE_Curve51_CP128_SHA512_bindings.ml lib/Hacl_HPKE_Curve51_CP256_SHA256_bindings.ml lib/Hacl_HPKE_Curve51_CP256_SHA512_bindings.ml lib/Hacl_HPKE_Curve51_CP32_SHA256_bindings.ml lib/Hacl_HPKE_Curve51_CP32_SHA512_bindings.ml lib/Hacl_HPKE_Curve64_CP128_SHA256_bindings.ml lib/Hacl_HPKE_Curve64_CP128_SHA512_bindings.ml lib/Hacl_HPKE_Curve64_CP256_SHA256_bindings.ml lib/Hacl_HPKE_Curve64_CP256_SHA512_bindings.ml lib/Hacl_HPKE_Curve64_CP32_SHA256_bindings.ml lib/Hacl_HPKE_Curve64_CP32_SHA512_bindings.ml lib/Hacl_HPKE_Interface_Hacl_Impl_HPKE_Hacl_Meta_HPKE_bindings.ml lib/Hacl_HPKE_P256_CP128_SHA256_bindings.ml lib/Hacl_HPKE_P256_CP256_SHA256_bindings.ml lib/Hacl_HPKE_P256_CP32_SHA256_bindings.ml lib/Hacl_Hash_Base_bindings.ml lib/Hacl_Hash_Blake2_bindings.ml lib/Hacl_Hash_Blake2b_256_bindings.ml lib/Hacl_Hash_Blake2s_128_bindings.ml lib/Hacl_Hash_MD5_bindings.ml lib/Hacl_Hash_SHA1_bindings.ml lib/Hacl_Hash_SHA2_bindings.ml lib/Hacl_Hash_SHA3_bindings.ml lib/Hacl_IntTypes_Intrinsics_128_bindings.ml lib/Hacl_IntTypes_Intrinsics_bindings.ml lib/Hacl_K256_ECDSA_bindings.ml lib/Hacl_NaCl_bindings.ml lib/Hacl_P256_bindings.ml lib/Hacl_Poly1305_128_bindings.ml lib/Hacl_Poly1305_256_bindings.ml lib/Hacl_Poly1305_32_bindings.ml lib/Hacl_RSAPSS_bindings.ml lib/Hacl_SHA2_Types_bindings.ml lib/Hacl_SHA2_Vec128_bindings.ml lib/Hacl_SHA2_Vec256_bindings.ml lib/Hacl_Salsa20_bindings.ml lib/Hacl_Spec_bindings.ml lib/Hacl_Streaming_Blake2_bindings.ml lib/Hacl_Streaming_Poly1305_32_bindings.ml lib/Hacl_Streaming_Types_bindings.ml lib/Lib_RandomBuffer_System_bindings.ml lib_gen/EverCrypt_AEAD_gen.ml lib_gen/EverCrypt_AutoConfig2_gen.ml lib_gen/EverCrypt_Chacha20Poly1305_gen.ml lib_gen/EverCrypt_Cipher_gen.ml lib_gen/EverCrypt_Curve25519_gen.ml lib_gen/EverCrypt_DRBG_gen.ml lib_gen/EverCrypt_Ed25519_gen.ml lib_gen/EverCrypt_Error_gen.ml lib_gen/EverCrypt_HKDF_gen.ml lib_gen/EverCrypt_HMAC_gen.ml lib_gen/EverCrypt_Hash_gen.ml lib_gen/EverCrypt_Poly1305_gen.ml lib_gen/Hacl_Bignum25519_51_gen.ml lib_gen/Hacl_Bignum256_32_gen.ml lib_gen/Hacl_Bignum256_gen.ml lib_gen/Hacl_Bignum32_gen.ml lib_gen/Hacl_Bignum4096_32_gen.ml lib_gen/Hacl_Bignum4096_gen.ml lib_gen/Hacl_Bignum64_gen.ml lib_gen/Hacl_Bignum_Base_gen.ml lib_gen/Hacl_Bignum_K256_gen.ml lib_gen/Hacl_Bignum_gen.ml lib_gen/Hacl_Chacha20Poly1305_128_gen.ml lib_gen/Hacl_Chacha20Poly1305_256_gen.ml lib_gen/Hacl_Chacha20Poly1305_32_gen.ml lib_gen/Hacl_Chacha20_Vec128_gen.ml lib_gen/Hacl_Chacha20_Vec256_gen.ml lib_gen/Hacl_Chacha20_Vec32_gen.ml lib_gen/Hacl_Chacha20_gen.ml lib_gen/Hacl_Curve25519_51_gen.ml lib_gen/Hacl_Curve25519_64_gen.ml lib_gen/Hacl_EC_Ed25519_gen.ml lib_gen/Hacl_EC_K256_gen.ml lib_gen/Hacl_Ed25519_gen.ml lib_gen/Hacl_FFDHE_gen.ml lib_gen/Hacl_Frodo1344_gen.ml lib_gen/Hacl_Frodo640_gen.ml lib_gen/Hacl_Frodo64_gen.ml lib_gen/Hacl_Frodo976_gen.ml lib_gen/Hacl_Frodo_KEM_gen.ml lib_gen/Hacl_GenericField32_gen.ml lib_gen/Hacl_GenericField64_gen.ml lib_gen/Hacl_HKDF_Blake2b_256_gen.ml lib_gen/Hacl_HKDF_Blake2s_128_gen.ml lib_gen/Hacl_HKDF_gen.ml lib_gen/Hacl_HMAC_Blake2b_256_gen.ml lib_gen/Hacl_HMAC_Blake2s_128_gen.ml lib_gen/Hacl_HMAC_DRBG_gen.ml lib_gen/Hacl_HMAC_gen.ml lib_gen/Hacl_HPKE_Curve51_CP128_SHA256_gen.ml lib_gen/Hacl_HPKE_Curve51_CP128_SHA512_gen.ml lib_gen/Hacl_HPKE_Curve51_CP256_SHA256_gen.ml lib_gen/Hacl_HPKE_Curve51_CP256_SHA512_gen.ml lib_gen/Hacl_HPKE_Curve51_CP32_SHA256_gen.ml lib_gen/Hacl_HPKE_Curve51_CP32_SHA512_gen.ml lib_gen/Hacl_HPKE_Curve64_CP128_SHA256_gen.ml lib_gen/Hacl_HPKE_Curve64_CP128_SHA512_gen.ml lib_gen/Hacl_HPKE_Curve64_CP256_SHA256_gen.ml lib_gen/Hacl_HPKE_Curve64_CP256_SHA512_gen.ml lib_gen/Hacl_HPKE_Curve64_CP32_SHA256_gen.ml lib_gen/Hacl_HPKE_Curve64_CP32_SHA512_gen.ml lib_gen/Hacl_HPKE_Interface_Hacl_Impl_HPKE_Hacl_Meta_HPKE_gen.ml lib_gen/Hacl_HPKE_P256_CP128_SHA256_gen.ml lib_gen/Hacl_HPKE_P256_CP256_SHA256_gen.ml lib_gen/Hacl_HPKE_P256_CP32_SHA256_gen.ml lib_gen/Hacl_Hash_Base_gen.ml lib_gen/Hacl_Hash_Blake2_gen.ml lib_gen/Hacl_Hash_Blake2b_256_gen.ml lib_gen/Hacl_Hash_Blake2s_128_gen.ml lib_gen/Hacl_Hash_MD5_gen.ml lib_gen/Hacl_Hash_SHA1_gen.ml lib_gen/Hacl_Hash_SHA2_gen.ml lib_gen/Hacl_Hash_SHA3_gen.ml lib_gen/Hacl_IntTypes_Intrinsics_128_gen.ml lib_gen/Hacl_IntTypes_Intrinsics_gen.ml lib_gen/Hacl_K256_ECDSA_gen.ml lib_gen/Hacl_NaCl_gen.ml lib_gen/Hacl_P256_gen.ml lib_gen/Hacl_Poly1305_128_gen.ml lib_gen/Hacl_Poly1305_256_gen.ml lib_gen/Hacl_Poly1305_32_gen.ml lib_gen/Hacl_RSAPSS_gen.ml lib_gen/Hacl_SHA2_Types_gen.ml lib_gen/Hacl_SHA2_Vec128_gen.ml lib_gen/Hacl_SHA2_Vec256_gen.ml lib_gen/Hacl_Salsa20_gen.ml lib_gen/Hacl_Spec_gen.ml lib_gen/Hacl_Streaming_Blake2_gen.ml lib_gen/Hacl_Streaming_Poly1305_32_gen.ml lib_gen/Hacl_Streaming_Types_gen.ml lib_gen/Lib_RandomBuffer_System_gen.ml > .depend.ocaml
# cd build && cmake -G"Unix Makefiles" -DCMAKE_BUILD_TYPE=Release ../
# -- The C compiler identification is GNU 12.2.0
# -- The CXX compiler identification is GNU 12.2.0
# -- Detecting C compiler ABI info
# -- Detecting C compiler ABI info - done
# -- Check for working C compiler: /usr/bin/cc - skipped
# -- Detecting C compile features
# -- Detecting C compile features - done
# -- Detecting CXX compiler ABI info
# -- Detecting CXX compiler ABI info - done
# -- Check for working CXX compiler: /usr/bin/c++ - skipped
# -- Detecting CXX compile features
# -- Detecting CXX compile features - done
# -- The ASM compiler identification is GNU
# -- Found assembler: /usr/bin/cc
# -- Bug 81300 check: FALSE
# -- int128 support: TRUE
# -- explicit_bzero support: TRUE
# -- vec128 support: TRUE
# -- vec256 support: TRUE
# -- Detected vale support
# -- Detected inline assembly support
# -- Detected intrinsics support
# -- Detected an x64 architecture
# -- Configuring done
# -- Generating done
# -- Build files have been written to: /home/opam/.opam/4.14/.opam-switch/build/hacl-star-raw.0.7.2/hacl-star-raw/build
# /usr/bin/make -C build
# make[1]: Entering directory '/home/opam/.opam/4.14/.opam-switch/build/hacl-star-raw.0.7.2/hacl-star-raw/build'
# make[2]: Entering directory '/home/opam/.opam/4.14/.opam-switch/build/hacl-star-raw.0.7.2/hacl-star-raw/build'
# make[3]: Entering directory '/home/opam/.opam/4.14/.opam-switch/build/hacl-star-raw.0.7.2/hacl-star-raw/build'
# make[3]: Leaving directory '/home/opam/.opam/4.14/.opam-switch/build/hacl-star-raw.0.7.2/hacl-star-raw/build'
# make[3]: Entering directory '/home/opam/.opam/4.14/.opam-switch/build/hacl-star-raw.0.7.2/hacl-star-raw/build'
# [  1%] Building C object CMakeFiles/hacl_vec128.dir/src/Hacl_Hash_Blake2s_128.c.o
# [  2%] Building C object CMakeFiles/hacl_vec128.dir/src/Hacl_Streaming_Blake2s_128.c.o
# [  2%] Building C object CMakeFiles/hacl_vec128.dir/src/Hacl_Bignum4096.c.o
# [  3%] Building C object CMakeFiles/hacl_vec128.dir/src/Hacl_Bignum64.c.o
# [  4%] Building C object CMakeFiles/hacl_vec128.dir/src/Hacl_GenericField64.c.o
# [  4%] Building C object CMakeFiles/hacl_vec128.dir/src/Hacl_Chacha20Poly1305_128.c.o
# [  5%] Building C object CMakeFiles/hacl_vec128.dir/src/Hacl_Poly1305_128.c.o
# [  5%] Building C object CMakeFiles/hacl_vec128.dir/src/Hacl_Chacha20_Vec128.c.o
# [  6%] Building C object CMakeFiles/hacl_vec128.dir/src/Hacl_Streaming_Poly1305_128.c.o
# [  7%] Building C object CMakeFiles/hacl_vec128.dir/src/Hacl_SHA2_Vec128.c.o
# [  7%] Building C object CMakeFiles/hacl_vec128.dir/src/Hacl_HKDF_Blake2s_128.c.o
# [  8%] Building C object CMakeFiles/hacl_vec128.dir/src/Hacl_HMAC_Blake2s_128.c.o
# [  9%] Building C object CMakeFiles/hacl_vec128.dir/src/Hacl_HPKE_Curve51_CP128_SHA256.c.o
# [  9%] Building C object CMakeFiles/hacl_vec128.dir/src/Hacl_HPKE_Curve51_CP128_SHA512.c.o
# [ 10%] Building C object CMakeFiles/hacl_vec128.dir/src/Hacl_HPKE_P256_CP128_SHA256.c.o
# [ 11%] Building C object CMakeFiles/hacl_vec128.dir/src/Hacl_HPKE_Curve64_CP128_SHA256.c.o
# [ 11%] Building C object CMakeFiles/hacl_vec128.dir/src/Hacl_HPKE_Curve64_CP128_SHA512.c.o
# make[3]: Leaving directory '/home/opam/.opam/4.14/.opam-switch/build/hacl-star-raw.0.7.2/hacl-star-raw/build'
# [ 11%] Built target hacl_vec128
# make[3]: Entering directory '/home/opam/.opam/4.14/.opam-switch/build/hacl-star-raw.0.7.2/hacl-star-raw/build'
# make[3]: Leaving directory '/home/opam/.opam/4.14/.opam-switch/build/hacl-star-raw.0.7.2/hacl-star-raw/build'
# make[3]: Entering directory '/home/opam/.opam/4.14/.opam-switch/build/hacl-star-raw.0.7.2/hacl-star-raw/build'
# [ 12%] Building C object CMakeFiles/hacl_vec256.dir/src/Hacl_Hash_Blake2b_256.c.o
# [ 13%] Building C object CMakeFiles/hacl_vec256.dir/src/Hacl_Streaming_Blake2b_256.c.o
# [ 13%] Building C object CMakeFiles/hacl_vec256.dir/src/Hacl_Chacha20Poly1305_256.c.o
# [ 14%] Building C object CMakeFiles/hacl_vec256.dir/src/Hacl_Poly1305_256.c.o
# [ 15%] Building C object CMakeFiles/hacl_vec256.dir/src/Hacl_Chacha20_Vec256.c.o
# [ 15%] Building C object CMakeFiles/hacl_vec256.dir/src/Hacl_Streaming_Poly1305_256.c.o
# [ 16%] Building C object CMakeFiles/hacl_vec256.dir/src/Hacl_SHA2_Vec256.c.o
# [ 17%] Building C object CMakeFiles/hacl_vec256.dir/src/Hacl_HKDF_Blake2b_256.c.o
# [ 17%] Building C object CMakeFiles/hacl_vec256.dir/src/Hacl_HMAC_Blake2b_256.c.o
# [ 18%] Building C object CMakeFiles/hacl_vec256.dir/src/Hacl_HPKE_Curve51_CP256_SHA256.c.o
# [ 19%] Building C object CMakeFiles/hacl_vec256.dir/src/Hacl_HPKE_Curve51_CP256_SHA512.c.o
# [ 19%] Building C object CMakeFiles/hacl_vec256.dir/src/Hacl_HPKE_P256_CP256_SHA256.c.o
# [ 20%] Building C object CMakeFiles/hacl_vec256.dir/src/Hacl_HPKE_Curve64_CP256_SHA256.c.o
# [ 21%] Building C object CMakeFiles/hacl_vec256.dir/src/Hacl_HPKE_Curve64_CP256_SHA512.c.o
# make[3]: Leaving directory '/home/opam/.opam/4.14/.opam-switch/build/hacl-star-raw.0.7.2/hacl-star-raw/build'
# [ 21%] Built target hacl_vec256
# make[3]: Entering directory '/home/opam/.opam/4.14/.opam-switch/build/hacl-star-raw.0.7.2/hacl-star-raw/build'
# make[3]: Leaving directory '/home/opam/.opam/4.14/.opam-switch/build/hacl-star-raw.0.7.2/hacl-star-raw/build'
# make[3]: Entering directory '/home/opam/.opam/4.14/.opam-switch/build/hacl-star-raw.0.7.2/hacl-star-raw/build'
# [ 21%] Building C object CMakeFiles/hacl.dir/src/Hacl_NaCl.c.o
# [ 22%] Building C object CMakeFiles/hacl.dir/src/Hacl_Salsa20.c.o
# [ 22%] Building C object CMakeFiles/hacl.dir/src/Hacl_Poly1305_32.c.o
# [ 23%] Building C object CMakeFiles/hacl.dir/src/Hacl_Curve25519_51.c.o
# [ 24%] Building C object CMakeFiles/hacl.dir/src/Hacl_HMAC_DRBG.c.o
# [ 24%] Building C object CMakeFiles/hacl.dir/src/Hacl_HMAC.c.o
# [ 25%] Building C object CMakeFiles/hacl.dir/src/Hacl_Hash_SHA2.c.o
# [ 26%] Building C object CMakeFiles/hacl.dir/src/Hacl_Hash_Blake2.c.o
# [ 26%] Building C object CMakeFiles/hacl.dir/src/Lib_Memzero0.c.o
# [ 27%] Building C object CMakeFiles/hacl.dir/src/Hacl_Ed25519.c.o
# [ 28%] Building C object CMakeFiles/hacl.dir/src/Hacl_EC_Ed25519.c.o
# [ 28%] Building C object CMakeFiles/hacl.dir/src/Hacl_Hash_Base.c.o
# [ 29%] Building C object CMakeFiles/hacl.dir/src/Hacl_Streaming_Blake2.c.o
# [ 30%] Building C object CMakeFiles/hacl.dir/src/Hacl_Bignum256_32.c.o
# [ 30%] Building C object CMakeFiles/hacl.dir/src/Hacl_Bignum.c.o
# [ 31%] Building C object CMakeFiles/hacl.dir/src/Hacl_Bignum256.c.o
# [ 32%] Building C object CMakeFiles/hacl.dir/src/Hacl_Bignum32.c.o
# [ 32%] Building C object CMakeFiles/hacl.dir/src/Hacl_Bignum4096_32.c.o
# [ 33%] Building C object CMakeFiles/hacl.dir/src/Hacl_GenericField32.c.o
# [ 34%] Building C object CMakeFiles/hacl.dir/src/Hacl_Chacha20Poly1305_32.c.o
# [ 34%] Building C object CMakeFiles/hacl.dir/src/Hacl_Chacha20.c.o
# [ 35%] Building C object CMakeFiles/hacl.dir/src/Hacl_Streaming_Poly1305_32.c.o
# [ 36%] Building C object CMakeFiles/hacl.dir/src/Hacl_Chacha20_Vec32.c.o
# [ 36%] Building C object CMakeFiles/hacl.dir/src/Hacl_P256.c.o
# [ 37%] Building C object CMakeFiles/hacl.dir/src/Hacl_K256_ECDSA.c.o
# [ 37%] Building C object CMakeFiles/hacl.dir/src/Hacl_EC_K256.c.o
# [ 38%] Building C object CMakeFiles/hacl.dir/src/Hacl_FFDHE.c.o
# [ 39%] Building C object CMakeFiles/hacl.dir/src/Hacl_Hash_SHA3.c.o
# [ 39%] Building C object CMakeFiles/hacl.dir/src/Hacl_Hash_SHA1.c.o
# [ 40%] Building C object CMakeFiles/hacl.dir/src/Hacl_Hash_MD5.c.o
# [ 41%] Building C object CMakeFiles/hacl.dir/src/Hacl_HKDF.c.o
# [ 41%] Building C object CMakeFiles/hacl.dir/src/Hacl_RSAPSS.c.o
# [ 42%] Building C object CMakeFiles/hacl.dir/src/Hacl_HPKE_Curve51_CP32_SHA256.c.o
# [ 43%] Building C object CMakeFiles/hacl.dir/src/Hacl_HPKE_Curve51_CP32_SHA512.c.o
# [ 43%] Building C object CMakeFiles/hacl.dir/src/Hacl_HPKE_P256_CP32_SHA256.c.o
# [ 44%] Building C object CMakeFiles/hacl.dir/src/Hacl_Frodo1344.c.o
# [ 45%] Building C object CMakeFiles/hacl.dir/src/Hacl_Frodo_KEM.c.o
# /home/opam/.opam/4.14/.opam-switch/build/hacl-star-raw.0.7.2/hacl-star-raw/src/Hacl_Frodo_KEM.c: In function 'randombytes_':
# /home/opam/.opam/4.14/.opam-switch/build/hacl-star-raw.0.7.2/hacl-star-raw/src/Hacl_Frodo_KEM.c:33:3: warning: 'Lib_RandomBuffer_System_randombytes' is deprecated: random_crypto [-Wdeprecated-declarations]
#    33 |   bool b = Lib_RandomBuffer_System_randombytes(res, len);
#       |   ^~~~
# In file included from /home/opam/.opam/4.14/.opam-switch/build/hacl-star-raw.0.7.2/hacl-star-raw/include/internal/Hacl_Frodo_KEM.h:40,
#                  from /home/opam/.opam/4.14/.opam-switch/build/hacl-star-raw.0.7.2/hacl-star-raw/src/Hacl_Frodo_KEM.c:26:
# /home/opam/.opam/4.14/.opam-switch/build/hacl-star-raw.0.7.2/hacl-star-raw/include/Lib_RandomBuffer_System.h:40:13: note: declared here
#    40 | extern bool Lib_RandomBuffer_System_randombytes(uint8_t *buf, uint32_t len);
#       |             ^~~~~~~~~~~~~~~~~~~~~~~~~~~~~~~~~~~
# [ 45%] Building C object CMakeFiles/hacl.dir/src/Lib_RandomBuffer_System.c.o
# [ 46%] Building C object CMakeFiles/hacl.dir/src/Hacl_Frodo640.c.o
# [ 47%] Building C object CMakeFiles/hacl.dir/src/Hacl_Frodo976.c.o
# [ 47%] Building C object CMakeFiles/hacl.dir/src/Hacl_Frodo64.c.o
# [ 48%] Building C object CMakeFiles/hacl.dir/src/EverCrypt_DRBG.c.o
# /home/opam/.opam/4.14/.opam-switch/build/hacl-star-raw.0.7.2/hacl-star-raw/src/EverCrypt_DRBG.c: In function 'instantiate_sha1':
# /home/opam/.opam/4.14/.opam-switch/build/hacl-star-raw.0.7.2/hacl-star-raw/src/EverCrypt_DRBG.c:250:3: warning: 'Lib_RandomBuffer_System_randombytes' is deprecated: random_crypto [-Wdeprecated-declarations]
#   250 |   bool ok = Lib_RandomBuffer_System_randombytes(entropy, min_entropy);
#       |   ^~~~
# In file included from /home/opam/.opam/4.14/.opam-switch/build/hacl-star-raw.0.7.2/hacl-star-raw/include/EverCrypt_DRBG.h:38,
#                  from /home/opam/.opam/4.14/.opam-switch/build/hacl-star-raw.0.7.2/hacl-star-raw/src/EverCrypt_DRBG.c:26:
# /home/opam/.opam/4.14/.opam-switch/build/hacl-star-raw.0.7.2/hacl-star-raw/include/Lib_RandomBuffer_System.h:40:13: note: declared here
#    40 | extern bool Lib_RandomBuffer_System_randombytes(uint8_t *buf, uint32_t len);
#       |             ^~~~~~~~~~~~~~~~~~~~~~~~~~~~~~~~~~~
# /home/opam/.opam/4.14/.opam-switch/build/hacl-star-raw.0.7.2/hacl-star-raw/src/EverCrypt_DRBG.c: In function 'instantiate_sha2_256':
# /home/opam/.opam/4.14/.opam-switch/build/hacl-star-raw.0.7.2/hacl-star-raw/src/EverCrypt_DRBG.c:340:3: warning: 'Lib_RandomBuffer_System_randombytes' is deprecated: random_crypto [-Wdeprecated-declarations]
#   340 |   bool ok = Lib_RandomBuffer_System_randombytes(entropy, min_entropy);
#       |   ^~~~
# /home/opam/.opam/4.14/.opam-switch/build/hacl-star-raw.0.7.2/hacl-star-raw/include/Lib_RandomBuffer_System.h:40:13: note: declared here
#    40 | extern bool Lib_RandomBuffer_System_randombytes(uint8_t *buf, uint32_t len);
#       |             ^~~~~~~~~~~~~~~~~~~~~~~~~~~~~~~~~~~
# /home/opam/.opam/4.14/.opam-switch/build/hacl-star-raw.0.7.2/hacl-star-raw/src/EverCrypt_DRBG.c: In function 'instantiate_sha2_384':
# /home/opam/.opam/4.14/.opam-switch/build/hacl-star-raw.0.7.2/hacl-star-raw/src/EverCrypt_DRBG.c:430:3: warning: 'Lib_RandomBuffer_System_randombytes' is deprecated: random_crypto [-Wdeprecated-declarations]
#   430 |   bool ok = Lib_RandomBuffer_System_randombytes(entropy, min_entropy);
#       |   ^~~~
# /home/opam/.opam/4.14/.opam-switch/build/hacl-star-raw.0.7.2/hacl-star-raw/include/Lib_RandomBuffer_System.h:40:13: note: declared here
#    40 | extern bool Lib_RandomBuffer_System_randombytes(uint8_t *buf, uint32_t len);
#       |             ^~~~~~~~~~~~~~~~~~~~~~~~~~~~~~~~~~~
# /home/opam/.opam/4.14/.opam-switch/build/hacl-star-raw.0.7.2/hacl-star-raw/src/EverCrypt_DRBG.c: In function 'instantiate_sha2_512':
# /home/opam/.opam/4.14/.opam-switch/build/hacl-star-raw.0.7.2/hacl-star-raw/src/EverCrypt_DRBG.c:520:3: warning: 'Lib_RandomBuffer_System_randombytes' is deprecated: random_crypto [-Wdeprecated-declarations]
#   520 |   bool ok = Lib_RandomBuffer_System_randombytes(entropy, min_entropy);
#       |   ^~~~
# /home/opam/.opam/4.14/.opam-switch/build/hacl-star-raw.0.7.2/hacl-star-raw/include/Lib_RandomBuffer_System.h:40:13: note: declared here
#    40 | extern bool Lib_RandomBuffer_System_randombytes(uint8_t *buf, uint32_t len);
#       |             ^~~~~~~~~~~~~~~~~~~~~~~~~~~~~~~~~~~
# /home/opam/.opam/4.14/.opam-switch/build/hacl-star-raw.0.7.2/hacl-star-raw/src/EverCrypt_DRBG.c: In function 'reseed_sha1':
# /home/opam/.opam/4.14/.opam-switch/build/hacl-star-raw.0.7.2/hacl-star-raw/src/EverCrypt_DRBG.c:608:3: warning: 'Lib_RandomBuffer_System_randombytes' is deprecated: random_crypto [-Wdeprecated-declarations]
#   608 |   bool ok = Lib_RandomBuffer_System_randombytes(entropy_input, entropy_input_len);
#       |   ^~~~
# /home/opam/.opam/4.14/.opam-switch/build/hacl-star-raw.0.7.2/hacl-star-raw/include/Lib_RandomBuffer_System.h:40:13: note: declared here
#    40 | extern bool Lib_RandomBuffer_System_randombytes(uint8_t *buf, uint32_t len);
#       |             ^~~~~~~~~~~~~~~~~~~~~~~~~~~~~~~~~~~
# /home/opam/.opam/4.14/.opam-switch/build/hacl-star-raw.0.7.2/hacl-star-raw/src/EverCrypt_DRBG.c: In function 'reseed_sha2_256':
# /home/opam/.opam/4.14/.opam-switch/build/hacl-star-raw.0.7.2/hacl-star-raw/src/EverCrypt_DRBG.c:689:3: warning: 'Lib_RandomBuffer_System_randombytes' is deprecated: random_crypto [-Wdeprecated-declarations]
#   689 |   bool ok = Lib_RandomBuffer_System_randombytes(entropy_input, entropy_input_len);
#       |   ^~~~
# /home/opam/.opam/4.14/.opam-switch/build/hacl-star-raw.0.7.2/hacl-star-raw/include/Lib_RandomBuffer_System.h:40:13: note: declared here
#    40 | extern bool Lib_RandomBuffer_System_randombytes(uint8_t *buf, uint32_t len);
#       |             ^~~~~~~~~~~~~~~~~~~~~~~~~~~~~~~~~~~
# /home/opam/.opam/4.14/.opam-switch/build/hacl-star-raw.0.7.2/hacl-star-raw/src/EverCrypt_DRBG.c: In function 'reseed_sha2_384':
# /home/opam/.opam/4.14/.opam-switch/build/hacl-star-raw.0.7.2/hacl-star-raw/src/EverCrypt_DRBG.c:770:3: warning: 'Lib_RandomBuffer_System_randombytes' is deprecated: random_crypto [-Wdeprecated-declarations]
#   770 |   bool ok = Lib_RandomBuffer_System_randombytes(entropy_input, entropy_input_len);
#       |   ^~~~
# /home/opam/.opam/4.14/.opam-switch/build/hacl-star-raw.0.7.2/hacl-star-raw/include/Lib_RandomBuffer_System.h:40:13: note: declared here
#    40 | extern bool Lib_RandomBuffer_System_randombytes(uint8_t *buf, uint32_t len);
#       |             ^~~~~~~~~~~~~~~~~~~~~~~~~~~~~~~~~~~
# /home/opam/.opam/4.14/.opam-switch/build/hacl-star-raw.0.7.2/hacl-star-raw/src/EverCrypt_DRBG.c: In function 'reseed_sha2_512':
# /home/opam/.opam/4.14/.opam-switch/build/hacl-star-raw.0.7.2/hacl-star-raw/src/EverCrypt_DRBG.c:851:3: warning: 'Lib_RandomBuffer_System_randombytes' is deprecated: random_crypto [-Wdeprecated-declarations]
#   851 |   bool ok = Lib_RandomBuffer_System_randombytes(entropy_input, entropy_input_len);
#       |   ^~~~
# /home/opam/.opam/4.14/.opam-switch/build/hacl-star-raw.0.7.2/hacl-star-raw/include/Lib_RandomBuffer_System.h:40:13: note: declared here
#    40 | extern bool Lib_RandomBuffer_System_randombytes(uint8_t *buf, uint32_t len);
#       |             ^~~~~~~~~~~~~~~~~~~~~~~~~~~~~~~~~~~
# /home/opam/.opam/4.14/.opam-switch/build/hacl-star-raw.0.7.2/hacl-star-raw/src/EverCrypt_DRBG.c: In function 'generate_sha1':
# /home/opam/.opam/4.14/.opam-switch/build/hacl-star-raw.0.7.2/hacl-star-raw/src/EverCrypt_DRBG.c:947:5: warning: 'Lib_RandomBuffer_System_randombytes' is deprecated: random_crypto [-Wdeprecated-declarations]
#   947 |     bool ok = Lib_RandomBuffer_System_randombytes(entropy_input, entropy_input_len1);
#       |     ^~~~
# /home/opam/.opam/4.14/.opam-switch/build/hacl-star-raw.0.7.2/hacl-star-raw/include/Lib_RandomBuffer_System.h:40:13: note: declared here
#    40 | extern bool Lib_RandomBuffer_System_randombytes(uint8_t *buf, uint32_t len);
#       |             ^~~~~~~~~~~~~~~~~~~~~~~~~~~~~~~~~~~
# /home/opam/.opam/4.14/.opam-switch/build/hacl-star-raw.0.7.2/hacl-star-raw/src/EverCrypt_DRBG.c: In function 'generate_sha2_256':
# /home/opam/.opam/4.14/.opam-switch/build/hacl-star-raw.0.7.2/hacl-star-raw/src/EverCrypt_DRBG.c:1168:5: warning: 'Lib_RandomBuffer_System_randombytes' is deprecated: random_crypto [-Wdeprecated-declarations]
#  1168 |     bool ok = Lib_RandomBuffer_System_randombytes(entropy_input, entropy_input_len1);
#       |     ^~~~
# /home/opam/.opam/4.14/.opam-switch/build/hacl-star-raw.0.7.2/hacl-star-raw/include/Lib_RandomBuffer_System.h:40:13: note: declared here
#    40 | extern bool Lib_RandomBuffer_System_randombytes(uint8_t *buf, uint32_t len);
#       |             ^~~~~~~~~~~~~~~~~~~~~~~~~~~~~~~~~~~
# /home/opam/.opam/4.14/.opam-switch/build/hacl-star-raw.0.7.2/hacl-star-raw/src/EverCrypt_DRBG.c: In function 'generate_sha2_384':
# /home/opam/.opam/4.14/.opam-switch/build/hacl-star-raw.0.7.2/hacl-star-raw/src/EverCrypt_DRBG.c:1389:5: warning: 'Lib_RandomBuffer_System_randombytes' is deprecated: random_crypto [-Wdeprecated-declarations]
#  1389 |     bool ok = Lib_RandomBuffer_System_randombytes(entropy_input, entropy_input_len1);
#       |     ^~~~
# /home/opam/.opam/4.14/.opam-switch/build/hacl-star-raw.0.7.2/hacl-star-raw/include/Lib_RandomBuffer_System.h:40:13: note: declared here
#    40 | extern bool Lib_RandomBuffer_System_randombytes(uint8_t *buf, uint32_t len);
#       |             ^~~~~~~~~~~~~~~~~~~~~~~~~~~~~~~~~~~
# /home/opam/.opam/4.14/.opam-switch/build/hacl-star-raw.0.7.2/hacl-star-raw/src/EverCrypt_DRBG.c: In function 'generate_sha2_512':
# /home/opam/.opam/4.14/.opam-switch/build/hacl-star-raw.0.7.2/hacl-star-raw/src/EverCrypt_DRBG.c:1610:5: warning: 'Lib_RandomBuffer_System_randombytes' is deprecated: random_crypto [-Wdeprecated-declarations]
#  1610 |     bool ok = Lib_RandomBuffer_System_randombytes(entropy_input, entropy_input_len1);
#       |     ^~~~
# /home/opam/.opam/4.14/.opam-switch/build/hacl-star-raw.0.7.2/hacl-star-raw/include/Lib_RandomBuffer_System.h:40:13: note: declared here
#    40 | extern bool Lib_RandomBuffer_System_randombytes(uint8_t *buf, uint32_t len);
#       |             ^~~~~~~~~~~~~~~~~~~~~~~~~~~~~~~~~~~
# [ 49%] Building C object CMakeFiles/hacl.dir/src/EverCrypt_HMAC.c.o
# [ 49%] Building C object CMakeFiles/hacl.dir/src/EverCrypt_Hash.c.o
# [ 50%] Building C object CMakeFiles/hacl.dir/src/EverCrypt_AutoConfig2.c.o
# [ 51%] Building C object CMakeFiles/hacl.dir/src/EverCrypt_Ed25519.c.o
# [ 51%] Building C object CMakeFiles/hacl.dir/src/EverCrypt_Curve25519.c.o
# [ 52%] Building C object CMakeFiles/hacl.dir/src/EverCrypt_HKDF.c.o
# [ 53%] Building C object CMakeFiles/hacl.dir/src/EverCrypt_Cipher.c.o
# [ 53%] Building C object CMakeFiles/hacl.dir/src/EverCrypt_Chacha20Poly1305.c.o
# [ 54%] Building C object CMakeFiles/hacl.dir/src/EverCrypt_Poly1305.c.o
# [ 54%] Building C object CMakeFiles/hacl.dir/src/EverCrypt_AEAD.c.o
# [ 55%] Building C object CMakeFiles/hacl.dir/src/Hacl_Curve25519_64.c.o
# [ 56%] Building C object CMakeFiles/hacl.dir/src/Hacl_HPKE_Curve64_CP32_SHA256.c.o
# [ 56%] Building C object CMakeFiles/hacl.dir/src/Hacl_HPKE_Curve64_CP32_SHA512.c.o
# [ 57%] Building ASM object CMakeFiles/hacl.dir/vale/src/cpuid-x86_64-linux.S.o
# [ 58%] Building ASM object CMakeFiles/hacl.dir/vale/src/sha256-x86_64-linux.S.o
# [ 58%] Building ASM object CMakeFiles/hacl.dir/vale/src/aesgcm-x86_64-linux.S.o
# [ 59%] Building ASM object CMakeFiles/hacl.dir/vale/src/curve25519-x86_64-linux.S.o
# [ 60%] Building ASM object CMakeFiles/hacl.dir/vale/src/poly1305-x86_64-linux.S.o
# [ 60%] Linking C shared library libhacl.so
# make[3]: Leaving directory '/home/opam/.opam/4.14/.opam-switch/build/hacl-star-raw.0.7.2/hacl-star-raw/build'
# [ 60%] Built target hacl
# make[3]: Entering directory '/home/opam/.opam/4.14/.opam-switch/build/hacl-star-raw.0.7.2/hacl-star-raw/build'
# make[3]: Leaving directory '/home/opam/.opam/4.14/.opam-switch/build/hacl-star-raw.0.7.2/hacl-star-raw/build'
# make[3]: Entering directory '/home/opam/.opam/4.14/.opam-switch/build/hacl-star-raw.0.7.2/hacl-star-raw/build'
# [ 61%] Building C object CMakeFiles/hacl_static.dir/src/Hacl_NaCl.c.o
# [ 62%] Building C object CMakeFiles/hacl_static.dir/src/Hacl_Salsa20.c.o
# [ 62%] Building C object CMakeFiles/hacl_static.dir/src/Hacl_Poly1305_32.c.o
# [ 63%] Building C object CMakeFiles/hacl_static.dir/src/Hacl_Curve25519_51.c.o
# [ 64%] Building C object CMakeFiles/hacl_static.dir/src/Hacl_HMAC_DRBG.c.o
# [ 64%] Building C object CMakeFiles/hacl_static.dir/src/Hacl_HMAC.c.o
# [ 65%] Building C object CMakeFiles/hacl_static.dir/src/Hacl_Hash_SHA2.c.o
# [ 66%] Building C object CMakeFiles/hacl_static.dir/src/Hacl_Hash_Blake2.c.o
# [ 66%] Building C object CMakeFiles/hacl_static.dir/src/Lib_Memzero0.c.o
# [ 67%] Building C object CMakeFiles/hacl_static.dir/src/Hacl_Ed25519.c.o
# [ 68%] Building C object CMakeFiles/hacl_static.dir/src/Hacl_EC_Ed25519.c.o
# [ 68%] Building C object CMakeFiles/hacl_static.dir/src/Hacl_Hash_Base.c.o
# [ 69%] Building C object CMakeFiles/hacl_static.dir/src/Hacl_Streaming_Blake2.c.o
# [ 70%] Building C object CMakeFiles/hacl_static.dir/src/Hacl_Bignum256_32.c.o
# [ 70%] Building C object CMakeFiles/hacl_static.dir/src/Hacl_Bignum.c.o
# [ 71%] Building C object CMakeFiles/hacl_static.dir/src/Hacl_Bignum256.c.o
# [ 71%] Building C object CMakeFiles/hacl_static.dir/src/Hacl_Bignum32.c.o
# [ 72%] Building C object CMakeFiles/hacl_static.dir/src/Hacl_Bignum4096_32.c.o
# [ 73%] Building C object CMakeFiles/hacl_static.dir/src/Hacl_GenericField32.c.o
# [ 73%] Building C object CMakeFiles/hacl_static.dir/src/Hacl_Chacha20Poly1305_32.c.o
# [ 74%] Building C object CMakeFiles/hacl_static.dir/src/Hacl_Chacha20.c.o
# [ 75%] Building C object CMakeFiles/hacl_static.dir/src/Hacl_Streaming_Poly1305_32.c.o
# [ 75%] Building C object CMakeFiles/hacl_static.dir/src/Hacl_Chacha20_Vec32.c.o
# [ 76%] Building C object CMakeFiles/hacl_static.dir/src/Hacl_P256.c.o
# /home/opam/.opam/4.14/.opam-switch/build/hacl-star-raw.0.7.2/hacl-star-raw/src/Hacl_P256.c:1982:1: fatal error: error writing to /tmp/cc4aYwFN.s: No space left on device
#  1982 | }
#       | ^
# compilation terminated.
# make[3]: *** [CMakeFiles/hacl_static.dir/build.make:398: CMakeFiles/hacl_static.dir/src/Hacl_P256.c.o] Error 1
# make[3]: Leaving directory '/home/opam/.opam/4.14/.opam-switch/build/hacl-star-raw.0.7.2/hacl-star-raw/build'
# make[2]: *** [CMakeFiles/Makefile2:169: CMakeFiles/hacl_static.dir/all] Error 2
# make[2]: Leaving directory '/home/opam/.opam/4.14/.opam-switch/build/hacl-star-raw.0.7.2/hacl-star-raw/build'
# make[1]: *** [Makefile:136: all] Error 2
# make[1]: Leaving directory '/home/opam/.opam/4.14/.opam-switch/build/hacl-star-raw.0.7.2/hacl-star-raw/build'
# make: *** [Makefile:52: build-c] Error 2
# make: Leaving directory '/home/opam/.opam/4.14/.opam-switch/build/hacl-star-raw.0.7.2/hacl-star-raw'



<><> Error report <><><><><><><><><><><><><><><><><><><><><><><><><><><><><><><>
+- The following actions failed
| - build hacl-star-raw       0.7.2
| - build octez-internal-libs 20.1
| - build tezos-rust-libs     1.6
+- 
+- The following changes have been performed (the rest was aborted)
| - install aches                            1.1.0
| - install aches-lwt                        1.1.0
| - install alcotest                         1.8.0
| - install angstrom                         0.16.1
| - install asetmap                          0.8.1
| - install asn1-combinators                 0.3.2
| - install astring                          0.8.5
| - install base                             v0.16.3
| - install base-bytes                       base
| - install base64                           3.5.1
| - install bheap                            2.0.0
| - install bigarray-compat                  1.1.0
| - install bigstring                        0.3
| - install bigstringaf                      0.10.0
| - install bls12-381                        20.1
| - install bos                              0.2.1
| - install ca-certs                         1.0.0
| - install camlp-streams                    5.0.1
| - install camlzip                          1.11
| - install checkseum                        0.5.2
| - install clap                             0.3.0
| - install class_group_vdf                  0.0.5
| - install cmdliner                         1.3.0
| - install cohttp                           5.3.1
| - install cohttp-lwt                       5.3.0
| - install cohttp-lwt-unix                  5.3.0
| - install conduit                          7.1.0
| - install conduit-lwt                      7.1.0
| - install conduit-lwt-unix                 7.1.0
| - install conf-autoconf                    0.2
| - install conf-bash                        1
| - install conf-cmake                       1
| - install conf-g++                         1.0
| - install conf-gmp                         4
| - install conf-gmp-powm-sec                3
| - install conf-libev                       4-12
| - install conf-libffi                      2.0.0
| - install conf-pkg-config                  4
| - install conf-rust                        0.1
| - install conf-rust-2021                   1
| - install conf-which                       1
| - install conf-zlib                        1
| - install cppo                             1.8.0
| - install csexp                            1.5.2
| - install cstruct                          6.2.0
| - install cstruct-lwt                      6.2.0
| - install ctypes                           0.23.0
| - install ctypes-foreign                   0.23.0
| - install ctypes_stubs_js                  0.1
| - install data-encoding                    1.0.1
| - install decompress                       1.5.3
| - install digestif                         1.2.0
| - install domain-name                      0.4.0
| - install dune-configurator                3.17.2
| - install duration                         0.2.1
| - install either                           1.0.0
| - install eqaf                             0.10
| - install ezjsonm                          1.3.0
| - install fmt                              0.9.0
| - install fpath                            0.7.3
| - install gen                              1.1
| - install gmap                             0.3.0
| - install hashcons                         1.4.0
| - install hex                              1.5.0
| - install index                            1.6.2
| - install integers                         0.7.0
| - install integers_stubs_js                1.0
| - install ipaddr                           5.6.0
| - install ipaddr-sexp                      5.6.0
| - install jane-street-headers              v0.16.0
| - install js_of_ocaml                      5.9.1
| - install js_of_ocaml-compiler             5.9.1
| - install json-data-encoding               1.0.1
| - install json-data-encoding-bson          1.0.1
| - install jsonm                            1.0.2
| - install jst-config                       v0.16.0
| - install kdf                              1.0.0
| - install logs                             0.7.0
| - install lru                              0.3.1
| - install lwt                              5.9.0
| - install lwt-canceler                     0.3
| - install lwt-exit                         1.0
| - install lwt-watcher                      0.2
| - install macaddr                          5.6.0
| - install magic-mime                       1.3.1
| - install menhir                           20240715
| - install menhirCST                        20240715
| - install menhirLib                        20240715
| - install menhirSdk                        20240715
| - install mirage-crypto                    1.2.0
| - install mirage-crypto-ec                 1.2.0
| - install mirage-crypto-pk                 1.2.0
| - install mirage-crypto-rng                1.2.0
| - install mtime                            2.1.0
| - install ocaml-compiler-libs              v0.12.4
| - install ocaml-migrate-parsetree          2.4.0
| - install ocaml-syntax-shims               1.0.0
| - install ocamlbuild                       0.15.0
| - install ocamlgraph                       2.1.0
| - install ocp-ocamlres                     0.4
| - install ocplib-endian                    1.2
| - install octez-alcotezt                   20.1
| - install octez-distributed-internal       20.1
| - install octez-distributed-lwt-internal   20.1
| - install ohex                             0.2.0
| - install optint                           0.3.0
| - install pprint                           20230830
| - install ppx_assert                       v0.16.0
| - install ppx_base                         v0.16.0
| - install ppx_cold                         v0.16.0
| - install ppx_compare                      v0.16.0
| - install ppx_derivers                     1.2.1
| - install ppx_deriving                     6.0.3
| - install ppx_enumerate                    v0.16.0
| - install ppx_expect                       v0.16.1
| - install ppx_globalize                    v0.16.0
| - install ppx_hash                         v0.16.0
| - install ppx_here                         v0.16.0
| - install ppx_import                       1.11.0
| - install ppx_inline_test                  v0.16.1
| - install ppx_optcomp                      v0.16.0
| - install ppx_repr                         0.7.0
| - install ppx_sexp_conv                    v0.16.0
| - install ppxlib                           0.35.0
| - install prbnmcn-basic-structures         0.0.1
| - install prbnmcn-linalg                   0.0.1
| - install prbnmcn-stats                    0.0.6
| - install pringo                           1.3
| - install progress                         0.4.0
| - install prometheus                       1.2
| - install prometheus-app                   1.2
| - install psq                              0.2.1
| - install ptime                            1.2.0
| - install pure-splitmix                    0.3
| - install pyml                             20231101
| - install qcheck-alcotest                  0.23
| - install qcheck-core                      0.23
| - install re                               1.12.0
| - install repr                             0.7.0
| - install resto                            1.2
| - install resto-acl                        1.2
| - install resto-cohttp                     1.2
| - install resto-cohttp-client              1.2
| - install resto-cohttp-self-serving-client 1.2
| - install resto-cohttp-server              1.2
| - install resto-directory                  1.2
| - install ringo                            1.1.0
| - install rresult                          0.7.0
| - install rusage                           1.0.0
| - install secp256k1-internal               0.4.0
| - install sedlex                           3.3
| - install semaphore-compat                 1.0.2
| - install seq                              base
| - install seqes                            0.3
| - install sexplib0                         v0.16.0
| - install stdcompat                        19
| - install stdint                           0.7.2
| - install stdio                            v0.16.0
| - install stdlib-random                    1.2.0
| - install stdlib-shims                     0.3.0
| - install stringext                        1.6.0
| - install tar                              2.6.0
| - install tar-unix                         2.6.0
| - install terminal                         0.4.0
| - install tezos-openapi                    20.1
| - install tezos-sapling-parameters         1.1.0
| - install tezt                             4.2.0
| - install time_now                         v0.16.0
| - install topkg                            1.0.7
| - install uri                              4.4.0
| - install uri-sexp                         4.4.0
| - install uucp                             16.0.0
| - install uutf                             1.0.3
| - install vector                           1.0.0
| - install x509                             1.0.5
| - install yaml                             3.2.0
| - install yojson                           2.2.2
| - install zarith                           1.13
| - install zarith_stubs_js                  v0.16.1
+- 

<><> ocaml-migrate-parsetree.2.4.0 installed successfully <><><><><><><><><><><>
=> Note: This package is deprecated.
# To update the current shell environment, run: eval $(opam env)

The former state can be restored with:
    /usr/bin/opam switch import "/home/opam/.opam/4.14/.opam-switch/backup/state-20250206004648.export"
OCaml

Innovation. Community. Security.