package mirage-solo5

  1. Overview
  2. Docs
On This Page
  1. Error log

mirage-solo5 0.6.2

Error log

The package failed to build. The error log from opam follows.

Opam plugin "depext" may require upgrading/reinstalling. Reinstall the plugin on the current switch? [Y/n] y
The following actions will be performed:
  - recompile opam-depext 1.2.1-1

<><> Processing actions <><><><><><><><><><><><><><><><><><><><><><><><><><><><>
-> retrieved opam-depext.1.2.1-1  (cached)
-> removed   opam-depext.1.2.1-1
-> installed opam-depext.1.2.1-1
Done.

<><> opam-depext.1.2.1-1 installed successfully <><><><><><><><><><><><><><><><>
=> opam-depext is unnecessary when used with opam >= 2.1. Please use opam install directly instead
# Run eval $(opam env) to update the current shell environment

<><> Carrying on to "opam depext -viy mirage-solo5.0.6.2 topkg.1.0.7 solo5-bindings-hvt.0.6.9 ocplib-endian.1.2 ocamlfind.1.9.6 ocamlbuild.0.14.3 obuild.0.1.11 mirage-runtime.4.4.1 metrics.0.4.1 macaddr.5.5.0 lwt.5.7.0 logs.0.7.0 ipaddr.5.5.0 functoria-runtime.4.4.1 fmt.0.9.0 dune-configurator.3.13.0 dune.3.13.0 domain-name.0.4.0 cstruct.6.2.0 csexp.1.5.2 cppo.1.6.9 conf-pkg-config.2 conf-libseccomp.1 cmdliner.1.2.0 bheap.1.0.0 base-bytes.base" 

You are using opam 2.1+, where external dependency handling has been integrated: consider calling opam directly, the 'depext' plugin interface is provided for backwards compatibility only
# Detecting depexts using vars: arch=x86_64, os=linux, os-distribution=debian, os-family=debian
# The following system packages are needed:
libseccomp-dev
linux-libc-dev
pkg-config
[NOTE] Package dune is already installed (current version is 3.13.0).
[NOTE] Package ocamlfind is already installed (current version is 1.9.6).
The following actions will be performed:
  - install cppo               1.6.9
  - install conf-pkg-config    2
  - install ocamlbuild         0.14.3
  - install macaddr            5.5.0
  - install cmdliner           1.2.0
  - install csexp              1.5.2
  - install ocaml-src          4.14.1 [required by ocaml-freestanding]
  - install base-bytes         base
  - install obuild             0.1.11
  - install domain-name        0.4.0
  - install conf-libseccomp    1
  - install topkg              1.0.7
  - install functoria-runtime  4.4.1
  - install dune-configurator  3.13.0
  - install ocplib-endian      1.2
  - install bheap              1.0.0
  - install ipaddr             5.5.0
  - install solo5-bindings-hvt 0.6.9
  - install fmt                0.9.0
  - install lwt                5.7.0
  - install ocaml-freestanding 0.6.7  [required by mirage-solo5]
  - install metrics            0.4.1
  - install cstruct            6.2.0
  - install logs               0.7.0
  - install mirage-runtime     4.4.1
  - install mirage-solo5       0.6.2
===== 26 to install =====

The following system packages will first need to be installed:
    libseccomp-dev pkg-config

<><> Handling external dependencies <><><><><><><><><><><><><><><><><><><><><><>
Let opam run your package manager to install the required system packages?
(answer 'n' for other options) [Y/n] y
+ /usr/bin/sudo "apt-get" "install" "-qq" "-yy" "libseccomp-dev" "pkg-config"
- debconf: delaying package configuration, since apt-utils is not installed
- Selecting previously unselected package libpkgconf3:amd64.
- (Reading database ... 
(Reading database ... 5%
(Reading database ... 10%
(Reading database ... 15%
(Reading database ... 20%
(Reading database ... 25%
(Reading database ... 30%
(Reading database ... 35%
(Reading database ... 40%
(Reading database ... 45%
(Reading database ... 50%
(Reading database ... 55%
(Reading database ... 60%
(Reading database ... 65%
(Reading database ... 70%
(Reading database ... 75%
(Reading database ... 80%
(Reading database ... 85%
(Reading database ... 90%
(Reading database ... 95%
(Reading database ... 100%
(Reading database ... 18743 files and directories currently installed.)
- Preparing to unpack .../libpkgconf3_1.8.1-1_amd64.deb ...
- Unpacking libpkgconf3:amd64 (1.8.1-1) ...
- Selecting previously unselected package libseccomp-dev:amd64.
- Preparing to unpack .../libseccomp-dev_2.5.4-1+b3_amd64.deb ...
- Unpacking libseccomp-dev:amd64 (2.5.4-1+b3) ...
- Selecting previously unselected package pkgconf-bin.
- Preparing to unpack .../pkgconf-bin_1.8.1-1_amd64.deb ...
- Unpacking pkgconf-bin (1.8.1-1) ...
- Selecting previously unselected package pkgconf:amd64.
- Preparing to unpack .../pkgconf_1.8.1-1_amd64.deb ...
- Unpacking pkgconf:amd64 (1.8.1-1) ...
- Selecting previously unselected package pkg-config:amd64.
- Preparing to unpack .../pkg-config_1.8.1-1_amd64.deb ...
- Unpacking pkg-config:amd64 (1.8.1-1) ...
- Setting up libseccomp-dev:amd64 (2.5.4-1+b3) ...
- Setting up libpkgconf3:amd64 (1.8.1-1) ...
- Setting up pkgconf-bin (1.8.1-1) ...
- Setting up pkgconf:amd64 (1.8.1-1) ...
- Setting up pkg-config:amd64 (1.8.1-1) ...
- Processing triggers for libc-bin (2.36-9+deb12u3) ...

<><> Processing actions <><><><><><><><><><><><><><><><><><><><><><><><><><><><>
Processing  2/78: [bheap.1.0.0: http]
Processing  3/78: [bheap.1.0.0: http]
Processing  4/78: [bheap.1.0.0: http]
Processing  5/78: [bheap.1.0.0: http]
Processing  6/78: [bheap.1.0.0: http]
Processing  7/78: [bheap.1.0.0: http]
Processing  8/78: [bheap.1.0.0: http] [conf-pkg-config: pkg-config]
-> installed base-bytes.base
Processing  9/78: [bheap.1.0.0: http] [conf-pkg-config: pkg-config]
Processing  9/78: [conf-pkg-config: pkg-config]
-> retrieved cmdliner.1.2.0  (cached)
Processing 10/78: [conf-pkg-config: pkg-config]
Processing 11/78: [cmdliner: make all] [conf-pkg-config: pkg-config]
-> retrieved cppo.1.6.9  (cached)
Processing 12/78: [cmdliner: make all] [conf-pkg-config: pkg-config]
Processing 13/78: [cmdliner: make all] [conf-pkg-config: pkg-config] [cppo: dune build]
- usage: pkgconf [OPTIONS] [LIBRARIES]
- 
- basic options:
- 
-   --help                            this message
-   --about                           print pkgconf version and license to stdout
-   --version                         print supported pkg-config version to stdout
-   --atleast-pkgconfig-version       check whether or not pkgconf is compatible
-                                     with a specified pkg-config version
-   --errors-to-stdout                print all errors on stdout instead of stderr
-   --print-errors                    ensure all errors are printed
-   --short-errors                    be less verbose about some errors
-   --silence-errors                  explicitly be silent about errors
-   --list-all                        list all known packages
-   --list-package-names              list all known package names
-   --simulate                        simulate walking the calculated dependency graph
-   --no-cache                        do not cache already seen packages when
-                                     walking the dependency graph
-   --log-file=filename               write an audit log to a specified file
-   --with-path=path                  adds a directory to the search path
-   --define-prefix                   override the prefix variable with one that is guessed based on
-                                     the location of the .pc file
-   --dont-define-prefix              do not override the prefix variable under any circumstances
-   --prefix-variable=varname         sets the name of the variable that pkgconf considers
-                                     to be the package prefix
-   --relocate=path                   relocates a path and exits (mostly for testsuite)
-   --dont-relocate-paths             disables path relocation support
- 
- cross-compilation personality support:
- 
-   --personality=triplet|filename    sets the personality to 'triplet' or a file named 'filename'
-   --dump-personality                dumps details concerning selected personality
- 
- checking specific pkg-config database entries:
- 
-   --atleast-version                 require a specific version of a module
-   --exact-version                   require an exact version of a module
-   --max-version                     require a maximum version of a module
-   --exists                          check whether or not a module exists
-   --uninstalled                     check whether or not an uninstalled module will be used
-   --no-uninstalled                  never use uninstalled modules when satisfying dependencies
-   --no-provides                     do not use 'provides' rules to resolve dependencies
-   --maximum-traverse-depth          maximum allowed depth for dependency graph
-   --static                          be more aggressive when computing dependency graph
-                                     (for static linking)
-   --shared                          use a simplified dependency graph (usually default)
-   --pure                            optimize a static dependency graph as if it were a normal
-                                     dependency graph
-   --env-only                        look only for package entries in PKG_CONFIG_PATH
-   --ignore-conflicts                ignore 'conflicts' rules in modules
-   --validate                        validate specific .pc files for correctness
- 
- querying specific pkg-config database fields:
- 
-   --define-variable=varname=value   define variable 'varname' as 'value'
-   --variable=varname                print specified variable entry to stdout
-   --cflags                          print required CFLAGS to stdout
-   --cflags-only-I                   print required include-dir CFLAGS to stdout
-   --cflags-only-other               print required non-include-dir CFLAGS to stdout
-   --libs                            print required linker flags to stdout
-   --libs-only-L                     print required LDPATH linker flags to stdout
-   --libs-only-l                     print required LIBNAME linker flags to stdout
-   --libs-only-other                 print required other linker flags to stdout
-   --print-requires                  print required dependency frameworks to stdout
-   --print-requires-private          print required dependency frameworks for static
-                                     linking to stdout
-   --print-provides                  print provided dependencies to stdout
-   --print-variables                 print all known variables in module to stdout
-   --digraph                         print entire dependency graph in graphviz 'dot' format
-   --keep-system-cflags              keep -I/usr/include entries in cflags output
-   --keep-system-libs                keep -L/lib:/lib/i386-linux-gnu:/lib/x86_64-linux-gnu:/lib/x86_64-linux-gnux32:/lib32:/libx32:/usr/lib:/usr/lib/i386-linux-gnu:/usr/lib/x86_64-linux-gnu:/usr/lib/x86_64-linux-gnux32:/usr/lib32:/usr/libx32 entries in libs output
-   --path                            show the exact filenames for any matching .pc files
-   --modversion                      print the specified module's version to stdout
-   --internal-cflags                 do not filter 'internal' cflags from output
- 
- filtering output:
- 
-   --msvc-syntax                     print translatable fragments in MSVC syntax
-   --fragment-filter=types           filter output fragments to the specified types
- 
- report bugs to <https://github.com/pkgconf/pkgconf/issues/new>.
-> compiled  conf-pkg-config.2
Processing 13/78: [cmdliner: make all] [cppo: dune build]
Processing 14/78: [cmdliner: make all] [cppo: dune build] [conf-pkg-config: mkdir]
-> retrieved bheap.1.0.0  (https://github.com/UnixJunkie/bheap/archive/v1.0.0.tar.gz)
Processing 15/78: [cmdliner: make all] [cppo: dune build] [conf-pkg-config: mkdir]
-> retrieved csexp.1.5.2  (cached)
Processing 16/78: [cmdliner: make all] [cppo: dune build] [conf-pkg-config: mkdir]
Processing 17/78: [cmdliner: make all] [cppo: dune build] [csexp: dune build] [conf-pkg-config: mkdir]
- ocaml build.ml cma
- ocaml build.ml cmxa
- ocaml build.ml cmxs
-> compiled  cmdliner.1.2.0
Processing 17/78: [cppo: dune build] [csexp: dune build] [conf-pkg-config: mkdir]
-> retrieved cstruct.6.2.0  (cached)
Processing 18/78: [cppo: dune build] [csexp: dune build] [conf-pkg-config: mkdir]
-> compiled  cppo.1.6.9
Processing 18/78: [csexp: dune build] [conf-pkg-config: mkdir]
-> installed conf-pkg-config.2
Processing 18/78: [csexp: dune build]
Processing 19/78: [conf-libseccomp: pkg-config libseccomp] [csexp: dune build]
Processing 20/78: [conf-libseccomp: pkg-config libseccomp] [csexp: dune build] [cmdliner: make install]
-> retrieved domain-name.0.4.0  (cached)
Processing 21/78: [conf-libseccomp: pkg-config libseccomp] [csexp: dune build] [cmdliner: make install]
Processing 22/78: [conf-libseccomp: pkg-config libseccomp] [csexp: dune build] [domain-name: dune build] [cmdliner: make install]
-> retrieved fmt.0.9.0  (cached)
Processing 23/78: [conf-libseccomp: pkg-config libseccomp] [csexp: dune build] [domain-name: dune build] [cmdliner: make install]
-> compiled  conf-libseccomp.1
Processing 23/78: [csexp: dune build] [domain-name: dune build] [cmdliner: make install]
- install -d "/home/opam/.opam/4.14/lib/cmdliner"
- install pkg/META _build/cmdliner.mli _build/cmdliner.cmi _build/cmdliner.cmti "/home/opam/.opam/4.14/lib/cmdliner"
- install cmdliner.opam "/home/opam/.opam/4.14/lib/cmdliner/opam"
- install _build/cmdliner.cma "/home/opam/.opam/4.14/lib/cmdliner"
- install _build/cmdliner.cmxa _build/cmdliner.a _build/cmdliner.cmx _build/cmdliner_arg.cmx _build/cmdliner_base.cmx _build/cmdliner_cline.cmx _build/cmdliner_cmd.cmx _build/cmdliner_docgen.cmx _build/cmdliner_eval.cmx _build/cmdliner_exit.cmx _build/cmdliner_info.cmx _build/cmdliner_manpage.cmx _build/cmdliner_msg.cmx _build/cmdliner_term.cmx _build/cmdliner_term_deprecated.cmx _build/cmdliner_trie.cmx \
-   "/home/opam/.opam/4.14/lib/cmdliner"
- install _build/cmdliner.cmxs "/home/opam/.opam/4.14/lib/cmdliner"
Processing 23/78: [csexp: dune build] [domain-name: dune build] [cmdliner: make install-doc]
-> retrieved ipaddr.5.5.0  (cached)
Processing 24/78: [csexp: dune build] [domain-name: dune build] [cmdliner: make install-doc]
-> compiled  csexp.1.5.2
Processing 24/78: [domain-name: dune build] [cmdliner: make install-doc]
-> retrieved functoria-runtime.4.4.1  (cached)
Processing 25/78: [domain-name: dune build] [cmdliner: make install-doc]
- install -d "/home/opam/.opam/4.14/doc/cmdliner/odoc-pages"
- install CHANGES.md LICENSE.md README.md "/home/opam/.opam/4.14/doc/cmdliner"
- install doc/index.mld doc/cli.mld doc/examples.mld doc/tutorial.mld \
-            doc/tool_man.mld "/home/opam/.opam/4.14/doc/cmdliner/odoc-pages"
-> installed cmdliner.1.2.0
Processing 25/78: [domain-name: dune build]
Processing 26/78: [domain-name: dune build] [functoria-runtime: dune build]
-> installed conf-libseccomp.1
Processing 27/78: [domain-name: dune build] [functoria-runtime: dune build]
-> installed cppo.1.6.9
Processing 28/78: [domain-name: dune build] [functoria-runtime: dune build]
-> installed csexp.1.5.2
Processing 29/78: [domain-name: dune build] [functoria-runtime: dune build]
-> retrieved logs.0.7.0  (cached)
Processing 30/78: [domain-name: dune build] [functoria-runtime: dune build]
-> retrieved lwt.5.7.0  (cached)
Processing 31/78: [domain-name: dune build] [functoria-runtime: dune build]
-> retrieved dune-configurator.3.13.0  (cached)
Processing 32/78: [domain-name: dune build] [functoria-runtime: dune build]
Processing 33/78: [domain-name: dune build] [dune-configurator: rm] [functoria-runtime: dune build]
-> compiled  domain-name.0.4.0
Processing 33/78: [dune-configurator: rm] [functoria-runtime: dune build]
-> installed domain-name.0.4.0
Processing 34/78: [dune-configurator: rm] [functoria-runtime: dune build]
-> compiled  functoria-runtime.4.4.1
Processing 34/78: [dune-configurator: rm]
-> installed functoria-runtime.4.4.1
Processing 35/78: [dune-configurator: rm]
-> retrieved macaddr.5.5.0  (cached)
Processing 36/78: [mirage-solo5.0.6.2: http] [dune-configurator: rm]
Processing 37/78: [mirage-solo5.0.6.2: http] [dune-configurator: rm] [macaddr: dune build]
-> retrieved metrics.0.4.1  (cached)
Processing 38/78: [mirage-solo5.0.6.2: http] [dune-configurator: rm] [macaddr: dune build]
-> retrieved mirage-runtime.4.4.1  (cached)
Processing 39/78: [mirage-solo5.0.6.2: http] [dune-configurator: rm] [macaddr: dune build]
-> retrieved obuild.0.1.11  (cached)
Processing 40/78: [mirage-solo5.0.6.2: http] [dune-configurator: rm] [macaddr: dune build]
Processing 41/78: [mirage-solo5.0.6.2: http] [dune-configurator: rm] [macaddr: dune build] [obuild: ./bootstrap]
-> retrieved ocaml-freestanding.0.6.7  (cached)
Processing 42/78: [mirage-solo5.0.6.2: http] [dune-configurator: rm] [macaddr: dune build] [obuild: ./bootstrap]
Processing 42/78: [dune-configurator: rm] [macaddr: dune build] [obuild: ./bootstrap]
-> compiled  macaddr.5.5.0
Processing 42/78: [dune-configurator: rm] [obuild: ./bootstrap]
-> installed macaddr.5.5.0
Processing 43/78: [dune-configurator: rm] [obuild: ./bootstrap]
Processing 44/78: [dune-configurator: rm] [ipaddr: dune build] [obuild: ./bootstrap]
Processing 44/78: [dune-configurator: dune build] [ipaddr: dune build] [obuild: ./bootstrap]
-> retrieved ocamlbuild.0.14.3  (cached)
Processing 45/78: [dune-configurator: dune build] [ipaddr: dune build] [obuild: ./bootstrap]
Processing 46/78: [dune-configurator: dune build] [ipaddr: dune build] [obuild: ./bootstrap] [ocamlbuild: make configure.make]
-> retrieved ocaml-src.4.14.1  (cached)
Processing 47/78: [dune-configurator: dune build] [ipaddr: dune build] [obuild: ./bootstrap] [ocamlbuild: make configure.make]
Processing 48/78: [dune-configurator: dune build] [ipaddr: dune build] [obuild: ./bootstrap] [ocamlbuild: make configure.make]
Processing 49/78: [dune-configurator: dune build] [ipaddr: dune build] [obuild: ./bootstrap] [ocamlbuild: make configure.make] [ocaml-src: cp .]
-> retrieved mirage-solo5.0.6.2  (https://github.com/mirage/mirage-solo5/releases/download/v0.6.2/mirage-solo5-v0.6.2.tbz)
Processing 50/78: [dune-configurator: dune build] [ipaddr: dune build] [obuild: ./bootstrap] [ocamlbuild: make configure.make] [ocaml-src: cp .]
-> compiled  ipaddr.5.5.0
Processing 50/78: [dune-configurator: dune build] [obuild: ./bootstrap] [ocamlbuild: make configure.make] [ocaml-src: cp .]
-> retrieved ocplib-endian.1.2  (cached)
Processing 51/78: [dune-configurator: dune build] [obuild: ./bootstrap] [ocamlbuild: make configure.make] [ocplib-endian: dune build] [ocaml-src: cp .]
- (echo "# This file was generated from configure.make"; \
- echo ;\
- echo "OCAML_PREFIX="; \
- echo "OCAML_BINDIR=/home/opam/.opam/4.14/bin"; \
- echo "OCAML_LIBDIR=/home/opam/.opam/4.14/lib/ocaml"; \
- echo "OCAML_MANDIR=/home/opam/.opam/4.14/man"; \
- echo ;\
- echo "EXT_OBJ=.o"; \
- echo "EXT_ASM=.s"; \
- echo "EXT_LIB=.a"; \
- echo "EXT_DLL=.so"; \
- echo "EXE="; \
- echo ;\
- echo "OCAML_NATIVE=true"; \
- echo "OCAML_NATIVE_TOOLS=true"; \
- echo "NATDYNLINK=true"; \
- echo "SUPPORT_SHARED_LIBRARIES=true"; \
- echo ;\
- echo "PREFIX=/home/opam/.opam/4.14"; \
- echo "BINDIR=/home/opam/.opam/4.14/bin"; \
- echo "LIBDIR=/home/opam/.opam/4.14/lib"; \
- echo "MANDIR=/home/opam/.opam/4.14/man"; \
- ) > Makefile.config
- (echo "(* This file was generated from ../configure.make *)"; \
- echo ;\
- echo 'let bindir = "/home/opam/.opam/4.14/bin"'; \
- echo 'let libdir = "/home/opam/.opam/4.14/lib"'; \
- echo 'let ocaml_libdir = "/home/opam/.opam/4.14/lib/ocaml"'; \
- echo 'let libdir_abs = "/home/opam/.opam/4.14/lib"'; \
- echo 'let ocaml_native = true'; \
- echo 'let ocaml_native_tools = true'; \
- echo 'let supports_shared_libraries = true';\
- echo 'let a = "a"'; \
- echo 'let o = "o"'; \
- echo 'let so = "so"'; \
- echo 'let ext_dll = ".so"'; \
- echo 'let exe = ""'; \
- echo 'let version = "0.14.3"'; \
- ) > src/ocamlbuild_config.ml
Processing 51/78: [dune-configurator: dune build] [obuild: ./bootstrap] [ocamlbuild: make check-if-preinstalled] [ocplib-endian: dune build] [ocaml-src: cp .]
-> retrieved solo5-bindings-hvt.0.6.9  (cached)
Processing 52/78: [dune-configurator: dune build] [obuild: ./bootstrap] [ocamlbuild: make check-if-preinstalled] [ocplib-endian: dune build] [solo5-bindings-hvt: ./configure.sh] [ocaml-src: cp .]
-> installed ocaml-src.4.14.1
Processing 52/78: [dune-configurator: dune build] [obuild: ./bootstrap] [ocamlbuild: make check-if-preinstalled] [ocplib-endian: dune build] [solo5-bindings-hvt: ./configure.sh]
-> installed ipaddr.5.5.0
Processing 53/78: [dune-configurator: dune build] [obuild: ./bootstrap] [ocamlbuild: make check-if-preinstalled] [ocplib-endian: dune build] [solo5-bindings-hvt: ./configure.sh]
-> compiled  dune-configurator.3.13.0
Processing 53/78: [obuild: ./bootstrap] [ocamlbuild: make check-if-preinstalled] [ocplib-endian: dune build] [solo5-bindings-hvt: ./configure.sh]
-> installed dune-configurator.3.13.0
Processing 54/78: [obuild: ./bootstrap] [ocamlbuild: make check-if-preinstalled] [ocplib-endian: dune build] [solo5-bindings-hvt: ./configure.sh]
-> retrieved topkg.1.0.7  (cached)
-> compiled  ocplib-endian.1.2
Processing 54/78: [obuild: ./bootstrap] [ocamlbuild: make check-if-preinstalled] [solo5-bindings-hvt: ./configure.sh]
-> installed ocplib-endian.1.2
Processing 55/78: [obuild: ./bootstrap] [ocamlbuild: make check-if-preinstalled] [solo5-bindings-hvt: ./configure.sh]
Processing 56/78: [lwt: dune exec] [obuild: ./bootstrap] [ocamlbuild: make check-if-preinstalled] [solo5-bindings-hvt: ./configure.sh]
- configure.sh: Configured for x86_64-linux-gnu.
- configure.sh: Enabled targets: hvt spt virtio muen xen.
Processing 56/78: [lwt: dune exec] [obuild: ./bootstrap] [ocamlbuild: make check-if-preinstalled] [solo5-bindings-hvt: make]
- 4.14.1
- Using compat403.ml
- COMPILING compat
- COMPILING fugue
- COMPILING filepath
- COMPILING filesystem
- BUILDING library Ext.cmo
- COMPILING types
- COMPILING gconf
- COMPILING filetype
- COMPILING dag
- COMPILING libname
- COMPILING pp
- COMPILING expr
- File "expr.ml", lines 129-131, characters 20-33:
- 129 | ....................match (string_split ':' v ~limit:2) with
- 130 |         [ _ ] -> ("", v)
- 131 |       | [ p1; rest] -> (p1, rest)...
- Warning 8 [partial-match]: this pattern-matching is not exhaustive.
- Here is an example of a case that is not matched:
- _::_::_::_
- File "expr.ml", lines 132-134, characters 23-35:
- 132 | .......................match (string_split '-' rest ~limit:2) with
- 133 |         [ _ ] -> (p1, rest, "")
- 134 |       | [ p2 ; p3 ] -> (p1, p2, p3)...
- Warning 8 [partial-match]: this pattern-matching is not exhaustive.
- Here is an example of a case that is not matched:
- _::_::_::_
- COMPILING utils
- File "utils.ml", line 70, characters 23-73:
- 70 |            try let _ = List.find (fun n -> Filesystem.exists (n p)) names in true
-                             ^^^^^^^^^^^^^^^^^^^^^^^^^^^^^^^^^^^^^^^^^^^^^^^^^^
- Warning 5 [ignored-partial-application]: this function application is partial,
- maybe some arguments are missing.
- COMPILING modname
- COMPILING taskdep
- COMPILING helper
- COMPILING dagutils
- COMPILING process
- COMPILING findlibConf
- COMPILING scheduler
- COMPILING prog
- COMPILING dependencies
- COMPILING generators
- COMPILING hier
- COMPILING meta
- COMPILING metacache
- COMPILING target
- COMPILING dist
- COMPILING project
- COMPILING analyze
- COMPILING configure
- COMPILING prepare
- File "prepare.ml", line 379, characters 10-113:
- 379 |           (match file_entry with Hier.FileEntry _ -> SimpleModule | Hier.GeneratedFileEntry _ -> GeneratedModule)
-                 ^^^^^^^^^^^^^^^^^^^^^^^^^^^^^^^^^^^^^^^^^^^^^^^^^^^^^^^^^^^^^^^^^^^^^^^^^^^^^^^^^^^^^^^^^^^^^^^^^^^^^^^
- Warning 8 [partial-match]: this pattern-matching is not exhaustive.
- Here is an example of a case that is not matched:
- DirectoryEntry _
- COMPILING buildprogs
- COMPILING build
- COMPILING exception
- BUILDING library Obuild.cmo
- COMPILING sdist
- COMPILING doc
- COMPILING init
- COMPILING help
- COMPILING install
- COMPILING path_generated
- COMPILING main
- LINKING obuild.bootstrap
- Configuring obuild-0.1.11...
- [ 1 of 57] Compiling Ext.Compat                    
- [ 2 of 57] Compiling Ext.Fugue                     
- File "ext/compat.ml", line 1:
- Warning 70 [missing-mli]: Cannot find interface file.
- 
- File "ext/fugue.ml", line 1:
- Warning 70 [missing-mli]: Cannot find interface file.
- 
- [ 3 of 57] Intfing Ext.Filepath                  
- [ 4 of 57] Compiling Ext.Filepath                  
- [ 5 of 57] Intfing Ext.Filesystem                
- [ 6 of 57] Compiling Ext.Filesystem                
- File "ext/filesystem.ml", lines 18-21, characters 11-58:
- 18 | ...........match (Unix.lstat fent).Unix.st_kind with
- 19 |            | Unix.S_DIR -> rmdir_recursive (Unix.rmdir) fent
- 20 |            | Unix.S_REG -> Unix.unlink fent
- 21 |            | _          -> raise (UnexpectedFileType fent)
- Warning 4 [fragile-match]: this pattern-matching is fragile.
- It will remain exhaustive when constructors are added to type Unix.file_kind.
- 
- [ 7 of 57] Packing Ext                           
- [ 8 of 57] Linking library dist/build/lib-obuild.ext/obuild_ext.cmxa
- [ 8 of 57] Linking library dist/build/lib-obuild.ext/obuild_ext.cmxs
- [ 8 of 57] Linking library dist/build/lib-obuild.ext/obuild_ext.cma
- [ 9 of 57] Checking dist/build/lib-obuild.ext
- [10 of 57] Compiling Obuild.Filetype               
- [11 of 57] Compiling Obuild.Gconf                  
- File "obuild/filetype.ml", line 1:
- Warning 70 [missing-mli]: Cannot find interface file.
- 
- [12 of 57] Compiling Obuild.Pp                     
- File "obuild/gconf.ml", line 1:
- Warning 70 [missing-mli]: Cannot find interface file.
- 
- [13 of 57] Compiling Obuild.Dag                    
- File "obuild/pp.ml", line 1:
- Warning 70 [missing-mli]: Cannot find interface file.
- File "obuild/pp.ml", line 2, characters 0-15:
- 2 | open Ext.Compat
-     ^^^^^^^^^^^^^^^
- Warning 33 [unused-open]: unused open Ext.Compat.
- 
- [14 of 57] Compiling Obuild.Expr                   
- File "obuild/dag.ml", line 1:
- Warning 70 [missing-mli]: Cannot find interface file.
- 
- [15 of 57] Compiling Obuild.Modname                
- File "obuild/expr.ml", lines 129-131, characters 20-33:
- 129 | ....................match (string_split ':' v ~limit:2) with
- 130 |         [ _ ] -> ("", v)
- 131 |       | [ p1; rest] -> (p1, rest)...
- Warning 8 [partial-match]: this pattern-matching is not exhaustive.
- Here is an example of a case that is not matched:
- _::_::_::_
- File "obuild/expr.ml", lines 132-134, characters 23-35:
- 132 | .......................match (string_split '-' rest ~limit:2) with
- 133 |         [ _ ] -> (p1, rest, "")
- 134 |       | [ p2 ; p3 ] -> (p1, p2, p3)...
- Warning 8 [partial-match]: this pattern-matching is not exhaustive.
- Here is an example of a case that is not matched:
- _::_::_::_
- File "obuild/expr.ml", lines 216-222, characters 8-9:
- 216 | ........(match r with
- 217 |          | Token.RPAREN :: r -> (Paren e, r)
- 218 |          | Token.OR :: _ | Token.AND :: _ ->
- 219 |            let (e, r) = parse_bin_expr e r in
- 220 |            loop e r
- 221 |          | _ -> raise UnbalancedParenthesis;
- 222 |         )
- Warning 4 [fragile-match]: this pattern-matching is fragile.
- It will remain exhaustive when constructors are added to type Token.t.
- File "obuild/expr.ml", lines 209-231, characters 4-82:
- 209 | ....match l with
- 210 |     | [] -> raise MalformedExpression
- 211 |     | Token.NOT :: r ->
- 212 |       let (e, r) = parse_sub_expr r in ((Not e), r)
- 213 |     | Token.LPAREN :: r ->
- ...
- 228 |     | Token.LT :: Token.VER v :: r -> (Lt v, r)
- 229 |     | Token.LE :: Token.VER v :: r -> (Le v, r)
- 230 |     | Token.NE :: Token.VER v :: r -> (Ne v, r)
- 231 |     | z              -> raise (UnknownExpression (showList "," Token.to_string z))
- Warning 4 [fragile-match]: this pattern-matching is fragile.
- It will remain exhaustive when constructors are added to type Token.t.
- File "obuild/expr.ml", lines 233-236, characters 4-36:
- 233 | ....match l with
- 234 |     | Token.OR :: r -> let (e, r) = parse_sub_expr r in ((Or (expr,e)), r)
- 235 |     | Token.AND :: r -> let (e, r) = parse_sub_expr r in ((And (expr,e)), r)
- 236 |     | _ -> raise MalformedExpression
- Warning 4 [fragile-match]: this pattern-matching is fragile.
- It will remain exhaustive when constructors are added to type Token.t.
- File "obuild/expr.ml", lines 268-271, characters 2-73:
- 268 | ..match Token.lexer s with
- 269 |   | []                    -> raise ExpressionEmpty
- 270 |   | Token.ID name :: constraints -> (name, (parse_constraints name constraints))
- 271 |   | x :: _           -> raise (InvalidDependencyName (Token.to_string x))
- Warning 4 [fragile-match]: this pattern-matching is fragile.
- It will remain exhaustive when constructors are added to type Token.t.
- File "obuild/expr.ml", line 1:
- Warning 70 [missing-mli]: Cannot find interface file.
- 
- [16 of 57] Compiling Obuild.Types                  
- File "obuild/modname.ml", line 1:
- Warning 70 [missing-mli]: Cannot find interface file.
- 
- [17 of 57] Compiling Obuild.Taskdep                
- File "obuild/types.ml", line 1:
- Warning 70 [missing-mli]: Cannot find interface file.
- 
- [18 of 57] Compiling Obuild.Libname                
- File "obuild/libname.ml", line 1:
- Warning 70 [missing-mli]: Cannot find interface file.
- 
- [19 of 57] Compiling Obuild.Utils                  
- File "obuild/taskdep.ml", line 1:
- Warning 70 [missing-mli]: Cannot find interface file.
- 
- [20 of 57] Compiling Obuild.Dagutils               
- File "obuild/dagutils.ml", line 1:
- Warning 70 [missing-mli]: Cannot find interface file.
- 
- File "obuild/utils.ml", line 70, characters 23-73:
- 70 |            try let _ = List.find (fun n -> Filesystem.exists (n p)) names in true
-                             ^^^^^^^^^^^^^^^^^^^^^^^^^^^^^^^^^^^^^^^^^^^^^^^^^^
- Warning 5 [ignored-partial-application]: this function application is partial,
- maybe some arguments are missing.
- File "obuild/utils.ml", line 1:
- Warning 70 [missing-mli]: Cannot find interface file.
- 
- [21 of 57] Compiling Obuild.Helper                 
- File "obuild/helper.ml", line 1:
- Warning 70 [missing-mli]: Cannot find interface file.
- 
- [22 of 57] Compiling Obuild.Process                
- File "obuild/process.ml", lines 95-97, characters 2-57:
- 95 | ..match pstat with
- 96 |   | Unix.WEXITED 0 -> Success (Buffer.contents p.out.buf, Buffer.contents p.err.buf, Unix.gettimeofday () -. p.time)
- 97 |   | _              -> Failure (Buffer.contents p.err.buf)
- Warning 4 [fragile-match]: this pattern-matching is fragile.
- It will remain exhaustive when constructors are added to type Unix.process_status.
- File "obuild/process.ml", line 1:
- Warning 70 [missing-mli]: Cannot find interface file.
- 
- [23 of 57] Compiling Obuild.Scheduler              
- [24 of 57] Compiling Obuild.FindlibConf            
- File "obuild/findlibConf.ml", line 1:
- Warning 70 [missing-mli]: Cannot find interface file.
- 
- [25 of 57] Compiling Obuild.Prog                   
- File "obuild/scheduler.ml", line 1:
- Warning 70 [missing-mli]: Cannot find interface file.
- 
- [26 of 57] Compiling Obuild.Meta                   
- File "obuild/prog.ml", line 1:
- Warning 70 [missing-mli]: Cannot find interface file.
- 
- [27 of 57] Compiling Obuild.Generators             
- File "obuild/generators.ml", line 55, characters 10-101:
- 55 |   let s = match ext with Filetype.FileOther s -> s | _ -> raise (GeneratorNotFound (fp_to_string fp)) in
-                ^^^^^^^^^^^^^^^^^^^^^^^^^^^^^^^^^^^^^^^^^^^^^^^^^^^^^^^^^^^^^^^^^^^^^^^^^^^^^^^^^^^^^^^^^^^
- Warning 4 [fragile-match]: this pattern-matching is fragile.
- It will remain exhaustive when constructors are added to type Filetype.t.
- File "obuild/generators.ml", line 1:
- Warning 70 [missing-mli]: Cannot find interface file.
- 
- [28 of 57] Compiling Obuild.Dependencies           
- File "obuild/dependencies.ml", line 1:
- Warning 70 [missing-mli]: Cannot find interface file.
- 
- [29 of 57] Compiling Obuild.Hier                   
- File "obuild/meta.ml", lines 129-130, characters 27-67:
- 129 | ...........................match p with Predicate.Neg n -> not (List.mem n constraints)
- 130 |                                       | _ -> List.mem p constraints.......
- Warning 4 [fragile-match]: this pattern-matching is fragile.
- It will remain exhaustive when constructors are added to type Predicate.t.
- File "obuild/meta.ml", lines 138-139, characters 29-63:
- 138 | .............................match p with Predicate.Neg n -> not (List.mem n preds)
- 139 |                                         | _ -> List.mem p preds...............
- Warning 4 [fragile-match]: this pattern-matching is fragile.
- It will remain exhaustive when constructors are added to type Predicate.t.
- File "obuild/meta.ml", lines 314-318, characters 28-36:
- 314 | ............................function
- 315 |     | COMMA :: ID s :: xs -> let (l, r) = parse_predicate xs in ((Predicate.of_string s) :: l, r)
- 316 |     | COMMA :: MINUS :: ID s :: xs ->
- 317 |       let (l, r) = parse_predicate xs in ((Predicate.Neg (Predicate.of_string s)) :: l, r)
- 318 |     | xs                 -> ([], xs)
- Warning 4 [fragile-match]: this pattern-matching is fragile.
- It will remain exhaustive when constructors are added to type t.
- File "obuild/meta.ml", lines 323-326, characters 48-95:
- 323 | ................................................match xs2 with
- 324 |         | RPAREN :: xs3 ->
- 325 |           ((Predicate.of_string s) :: preds, xs3)
- 326 |         | _ -> raise (MetaParseError (name, ("expecting ')' after " ^ field ^ "'s predicate")))
- Warning 4 [fragile-match]: this pattern-matching is fragile.
- It will remain exhaustive when constructors are added to type t.
- File "obuild/meta.ml", lines 329-332, characters 48-95:
- 329 | ................................................match xs2 with
- 330 |         | RPAREN :: xs3 ->
- 331 |           ((Predicate.Neg (Predicate.of_string s)) :: preds, xs3)
- 332 |         | _ -> raise (MetaParseError (name, ("expecting ')' after " ^ field ^ "'s predicate")))
- Warning 4 [fragile-match]: this pattern-matching is fragile.
- It will remain exhaustive when constructors are added to type t.
- File "obuild/meta.ml", lines 320-334, characters 40-20:
- 320 | ........................................function
- 321 |     | LPAREN :: RPAREN :: xs -> ([], xs)
- 322 |     | LPAREN :: ID s :: xs ->
- 323 |       (let (preds, xs2) = parse_predicate xs in match xs2 with
- 324 |         | RPAREN :: xs3 ->
- ...
- 331 |           ((Predicate.Neg (Predicate.of_string s)) :: preds, xs3)
- 332 |         | _ -> raise (MetaParseError (name, ("expecting ')' after " ^ field ^ "'s predicate")))
- 333 |       )
- 334 |     | xs -> ([], xs)
- Warning 4 [fragile-match]: this pattern-matching is fragile.
- It will remain exhaustive when constructors are added to type t.
- File "obuild/meta.ml", lines 346-353, characters 8-75:
- 346 | ........match xs2 with
- 347 |         | PLUSEQ :: S reqs :: xs3
- 348 |         | EQ :: S reqs :: xs3 ->
- 349 |           let deps = List.map (fun r -> Libname.of_string r)
- 350 |                      $ (List.filter (fun x -> x <> "") $ string_split_pred (fun c -> List.mem c [',';' ']) reqs)
- 351 |           in
- 352 |           parse pkg_name { acc with Pkg.requires = (preds, (List.rev deps)) :: acc.Pkg.requires } xs3
- 353 |         | _ -> raise (MetaParseError (pkg_name, "parsing requires failed"))
- Warning 4 [fragile-match]: this pattern-matching is fragile.
- It will remain exhaustive when constructors are added to type t.
- File "obuild/meta.ml", lines 360-364, characters 8-74:
- 360 | ........match xs2 with
- 361 |         | EQ :: S v :: xs3 ->
- 362 |           let nacc = { acc with Pkg.warning = acc.Pkg.warning @ [(preds, v)] } in
- 363 |           parse pkg_name nacc xs3
- 364 |         | _ -> raise (MetaParseError (pkg_name, "parsing warning failed"))
- Warning 4 [fragile-match]: this pattern-matching is fragile.
- It will remain exhaustive when constructors are added to type t.
- File "obuild/meta.ml", lines 369-376, characters 8-74:
- 369 | ........match xs2 with
- 370 |         | PLUSEQ :: S v :: xs3 ->
- 371 |           let nacc = { acc with Pkg.append_archives = acc.Pkg.append_archives @ [(preds, v)] } in
- 372 |           parse pkg_name nacc xs3
- 373 |         | EQ :: S v :: xs3 ->
- 374 |           let nacc = { acc with Pkg.archives = acc.Pkg.archives @ [(preds, v)] } in
- 375 |           parse pkg_name nacc xs3
- 376 |         | _ -> raise (MetaParseError (pkg_name, "parsing archive failed"))
- Warning 4 [fragile-match]: this pattern-matching is fragile.
- It will remain exhaustive when constructors are added to type t.
- File "obuild/meta.ml", lines 381-388, characters 8-73:
- 381 | ........match xs2 with
- 382 |         | PLUSEQ :: S v :: xs3 ->
- 383 |           let nacc = { acc with Pkg.append_archives = acc.Pkg.append_archives @ [(preds, v)] } in
- 384 |           parse pkg_name nacc xs3
- 385 |         | EQ :: S v :: xs3 ->
- 386 |           let nacc = { acc with Pkg.archives = acc.Pkg.archives @ [(preds, v)] } in
- 387 |           parse pkg_name nacc xs3
- 388 |         | _ -> raise (MetaParseError (pkg_name, "parsing plugin failed"))
- Warning 4 [fragile-match]: this pattern-matching is fragile.
- It will remain exhaustive when constructors are added to type t.
- File "obuild/meta.ml", lines 393-396, characters 8-70:
- 393 | ........match xs2 with
- 394 |         | EQ :: S v :: xs3 ->
- 395 |           parse pkg_name { acc with Pkg.ppx = Some (preds, v)} xs3
- 396 |         | _ -> raise (MetaParseError (pkg_name, "parsing ppx failed"))
- Warning 4 [fragile-match]: this pattern-matching is fragile.
- It will remain exhaustive when constructors are added to type t.
- File "obuild/meta.ml", lines 400-404, characters 8-73:
- 400 | ........match xs2 with
- 401 |         | PLUSEQ :: S v :: xs3 
- 402 |         | EQ :: S v :: xs3 ->
- 403 |           parse pkg_name { acc with Pkg.ppxopt = acc.Pkg.ppxopt @ [(preds, v)]} xs3
- 404 |         | _ -> raise (MetaParseError (pkg_name, "parsing ppxopt failed"))
- Warning 4 [fragile-match]: this pattern-matching is fragile.
- It will remain exhaustive when constructors are added to type t.
- File "obuild/meta.ml", lines 409-412, characters 26-57:
- 409 | ..........................function
- 410 |           | RPAREN::zs -> zs
- 411 |           | _::zs      -> consume zs
- 412 |           | []         -> failwith "eof in error context"
- Warning 4 [fragile-match]: this pattern-matching is fragile.
- It will remain exhaustive when constructors are added to type t.
- File "obuild/meta.ml", lines 414-416, characters 8-61:
- 414 | ........match consume xs with
- 415 |         | EQ :: S _ :: xs2 -> parse pkg_name acc xs2
- 416 |         | _                -> failwith "parsing error failed"
- Warning 4 [fragile-match]: this pattern-matching is fragile.
- It will remain exhaustive when constructors are added to type t.
- File "obuild/meta.ml", lines 420-423, characters 8-74:
- 420 | ........match xs2 with
- 421 |         | EQ :: S s :: xs3 ->
- 422 |           parse pkg_name { acc with Pkg.linkopts = ((if preds = [] then None else Some preds), s) :: acc.Pkg.linkopts } xs3
- 423 |         | _         -> failwith "parsing linkopts failed, expecting equal"
- Warning 4 [fragile-match]: this pattern-matching is fragile.
- It will remain exhaustive when constructors are added to type t.
- File "obuild/meta.ml", lines 336-428, characters 31-97:
- 336 | ...............................function
- 337 |     | []           -> (acc, [])
- 338 |     | RPAREN :: xs -> (acc, xs)
- 339 |     | ID "package" :: S name :: LPAREN :: xs ->
- 340 |       (let (pkg, xs2) = parse pkg_name (Pkg.make name) xs in
- ...
- 425 |     | ID stuff :: EQ :: S stuffVal :: xs ->
- 426 |       parse pkg_name { acc with Pkg.assignment = (stuff, stuffVal) :: acc.Pkg.assignment } xs
- 427 |     | x :: xs -> raise (MetaParseError (pkg_name, ("unknown token '" ^ to_string x ^ "' in meta file\n" ^
- 428 |                                                    (String.concat " " (List.map to_string xs)))))
- Warning 4 [fragile-match]: this pattern-matching is fragile.
- It will remain exhaustive when constructors are added to type t.
- File "obuild/meta.ml", line 1:
- Warning 70 [missing-mli]: Cannot find interface file.
- File "obuild/meta.ml", line 5, characters 0-11:
- 5 | open Helper
-     ^^^^^^^^^^^
- Warning 33 [unused-open]: unused open Helper.
- File "obuild/meta.ml", line 6, characters 0-10:
- 6 | open Gconf
-     ^^^^^^^^^^
- Warning 33 [unused-open]: unused open Gconf.
- File "obuild/meta.ml", line 136, characters 39-42:
- 136 |   let get_archive_with_filter (_, pkg) dep preds =
-                                              ^^^
- Warning 27 [unused-var-strict]: unused variable dep.
- 
- [30 of 57] Compiling Obuild.Metacache              
- File "obuild/hier.ml", line 1:
- Warning 70 [missing-mli]: Cannot find interface file.
- File "obuild/hier.ml", line 4, characters 0-10:
- 4 | open Types
-     ^^^^^^^^^^
- Warning 33 [unused-open]: unused open Types.
- 
- [31 of 57] Compiling Obuild.Target                 
- File "obuild/metacache.ml", line 1:
- Warning 70 [missing-mli]: Cannot find interface file.
- File "obuild/metacache.ml", line 1, characters 0-9:
- 1 | open Meta
-     ^^^^^^^^^
- Warning 33 [unused-open]: unused open Meta.
- 
- File "obuild/target.ml", line 1:
- Warning 70 [missing-mli]: Cannot find interface file.
- 
- [32 of 57] Compiling Obuild.Project                
- [33 of 57] Compiling Obuild.Dist                   
- File "obuild/dist.ml", line 1:
- Warning 70 [missing-mli]: Cannot find interface file.
- 
- File "obuild/project.ml", line 1:
- Warning 70 [missing-mli]: Cannot find interface file.
- 
- [34 of 57] Compiling Obuild.Analyze                
- File "obuild/analyze.ml", lines 80-82, characters 7-18:
- 80 | .......match name with
- 81 |        | Name.Lib lname -> Some lname
- 82 |        | _ -> None.
- Warning 4 [fragile-match]: this pattern-matching is fragile.
- It will remain exhaustive when constructors are added to type Target.Name.t.
- File "obuild/analyze.ml", lines 247-256, characters 15-26:
- 247 | ...............match preds with
- 248 |                | [ Meta.Predicate.Toploop ] -> ()
- 249 |                | _ ->
- 250 |                  List.iter
- 251 |                    (fun reqDep ->
- 252 |                       verbose Debug "  library %s depends on %s\n"
- 253 |                         (Libname.to_string dep) (Libname.to_string reqDep);
- 254 |                       Dag.addEdge (Dependency dep) (Dependency reqDep) depsDag;
- 255 |                       loop reqDep)
- 256 |                    reqDeps.
- Warning 4 [fragile-match]: this pattern-matching is fragile.
- It will remain exhaustive when constructors are added to type Meta.Predicate.t.
- File "obuild/analyze.ml", lines 275-279, characters 9-29:
- 275 | .........match target.target_name with
- 276 |          | Name.Lib l ->
- 277 |            Dag.addNode (Dependency l) depsDag;
- 278 |            Dag.addEdge (Dependency l)
- 279 |          | _ -> fun _ _ -> ()
- Warning 4 [fragile-match]: this pattern-matching is fragile.
- It will remain exhaustive when constructors are added to type Target.Name.t.
- File "obuild/analyze.ml", line 1:
- Warning 70 [missing-mli]: Cannot find interface file.
- 
- [35 of 57] Compiling Obuild.Configure              
- [36 of 57] Compiling Obuild.Prepare                
- File "obuild/configure.ml", line 1:
- Warning 70 [missing-mli]: Cannot find interface file.
- 
- File "obuild/prepare.ml", lines 168-170, characters 8-32:
- 168 | ........match node with
- 169 |         | Dependency dep -> Some dep
- 170 |         | _              -> None
- Warning 4 [fragile-match]: this pattern-matching is fragile.
- It will remain exhaustive when constructors are added to type Analyze.dependency_tag.
- File "obuild/prepare.ml", lines 218-228, characters 17-15:
- 218 | .................(match Filetype.of_filepath fp with
- 219 |                 | Filetype.FileML  -> Some (Modname.of_filename f)
- 220 |                 | Filetype.FileMLI  ->
- 221 |                   if (Filesystem.exists (srcDir </> ((chop_extension f) <.> "ml"))) then
- 222 |                     None
- ...
- 225 |                 | Filetype.FileOther s -> if Generators.is_generator_ext s then Some (Modname.of_filename f)
- 226 |                   else None
- 227 |                 | _                -> None
- 228 |               )
- Warning 4 [fragile-match]: this pattern-matching is fragile.
- It will remain exhaustive when constructors are added to type Filetype.t.
- File "obuild/prepare.ml", line 379, characters 10-113:
- 379 |           (match file_entry with Hier.FileEntry _ -> SimpleModule | Hier.GeneratedFileEntry _ -> GeneratedModule)
-                 ^^^^^^^^^^^^^^^^^^^^^^^^^^^^^^^^^^^^^^^^^^^^^^^^^^^^^^^^^^^^^^^^^^^^^^^^^^^^^^^^^^^^^^^^^^^^^^^^^^^^^^^
- Warning 8 [partial-match]: this pattern-matching is not exhaustive.
- Here is an example of a case that is not matched:
- DirectoryEntry _
- File "obuild/prepare.ml", lines 489-493, characters 10-19:
- 489 | ..........match r with
- 490 |           | CompileModule _ | CompileDirectory _->
- 491 |             Dag.addEdge (LinkTarget target) r stepsDag;
- 492 |             Dag.addEdge (CheckTarget target) (LinkTarget target) stepsDag;
- 493 |           | _ -> ()
- Warning 4 [fragile-match]: this pattern-matching is fragile.
- It will remain exhaustive when constructors are added to type compile_step.
- File "obuild/prepare.ml", lines 552-554, characters 6-18:
- 552 | ......match Hashtbl.find conf.project_dep_data dep with
- 553 |       | Internal -> true
- 554 |       | _ -> false............
- Warning 4 [fragile-match]: this pattern-matching is fragile.
- It will remain exhaustive when constructors are added to type Analyze.dep_type.
- File "obuild/prepare.ml", line 1:
- Warning 70 [missing-mli]: Cannot find interface file.
- File "obuild/prepare.ml", line 202, characters 9-16:
- 202 |     let (srcPath,srcDir) =
-                ^^^^^^^
- Warning 27 [unused-var-strict]: unused variable srcPath.
- File "obuild/prepare.ml", line 233, characters 13-20:
- 233 |         let (srcPath, srcFile, intfFile) =
-                    ^^^^^^^
- Warning 27 [unused-var-strict]: unused variable srcPath.
- File "obuild/prepare.ml", line 239, characters 37-41:
- 239 |           | Hier.GeneratedFileEntry (path, file, generated) ->
-                                            ^^^^
- Warning 27 [unused-var-strict]: unused variable path.
- 
- [37 of 57] Compiling Obuild.Buildprogs             
- File "obuild/buildprogs.ml", lines 69-73, characters 14-73:
- 69 | ..............function
- 70 |     | Filetype.FileML -> ext
- 71 |     | Filetype.FileMLI -> Filetype.FileCMI
- 72 |     | _ -> (* It should not happen *)
- 73 |       if buildMode = ByteCode then Filetype.FileCMO else Filetype.FileCMX
- Warning 4 [fragile-match]: this pattern-matching is fragile.
- It will remain exhaustive when constructors are added to type Filetype.t.
- File "obuild/buildprogs.ml", line 1:
- Warning 70 [missing-mli]: Cannot find interface file.
- File "obuild/buildprogs.ml", line 66, characters 17-23:
- 66 | let runOcamlPack srcDir dstDir annotMode buildMode packOpt dest modules =
-                       ^^^^^^
- Warning 27 [unused-var-strict]: unused variable srcDir.
- 
- [38 of 57] Compiling Obuild.Build                  
- File "obuild/build.ml", lines 60-72, characters 45-7:
- 60 | .............................................(
- 61 |         match srcTy with
- 62 |         | Filetype.FileCMX | Filetype.FileCMO ->
- 63 |           let bml = Filetype.replace_extension bdest Filetype.FileML in
- 64 |           let bmli = Filetype.replace_extension bdest Filetype.FileMLI in
- ...
- 69 |           "Library changed " ^ fp_to_string changedSrc
- 70 |         | _ ->
- 71 |           "Dependencies changed " ^ fp_to_string changedSrc
- 72 |       )
- Warning 4 [fragile-match]: this pattern-matching is fragile.
- It will remain exhaustive when constructors are added to type Filetype.t.
- File "obuild/build.ml", lines 59-80, characters 4-42:
- 59 | ....match Filetype.of_filename bdest with
- 60 |     | Filetype.FileCMX | Filetype.FileCMO -> (
- 61 |         match srcTy with
- 62 |         | Filetype.FileCMX | Filetype.FileCMO ->
- 63 |           let bml = Filetype.replace_extension bdest Filetype.FileML in
- ...
- 77 |       else if bh = bsrc then ("H file " ^ fn_to_string bsrc ^ " changed")
- 78 |       else ("file changed " ^ fp_to_string changedSrc)
- 79 |     | _ ->
- 80 |       fp_to_string changedSrc ^ " changed"
- Warning 4 [fragile-match]: this pattern-matching is fragile.
- It will remain exhaustive when constructors are added to type Filetype.t.
- File "obuild/build.ml", line 89, characters 6-63:
- 89 |       match (t,o) with (ByteCode,WithProf) -> false | _ -> true) all_modes
-            ^^^^^^^^^^^^^^^^^^^^^^^^^^^^^^^^^^^^^^^^^^^^^^^^^^^^^^^^^
- Warning 4 [fragile-match]: this pattern-matching is fragile.
- It will remain exhaustive when constructors are added to type Types.ocaml_compiled_type.
- File "obuild/build.ml", line 89, characters 6-63:
- 89 |       match (t,o) with (ByteCode,WithProf) -> false | _ -> true) all_modes
-            ^^^^^^^^^^^^^^^^^^^^^^^^^^^^^^^^^^^^^^^^^^^^^^^^^^^^^^^^^
- Warning 4 [fragile-match]: this pattern-matching is fragile.
- It will remain exhaustive when constructors are added to type Types.ocaml_compilation_option.
- File "obuild/build.ml", lines 150-155, characters 20-21:
- 150 | ....................match e with
- 151 |           Hier.FileEntry (_, f) ->
- 152 |             if (Filetype.of_filepath f) = Filetype.FileMLI then
- 153 |               Some m
- 154 |             else None
- 155 |           | _ -> None
- Warning 4 [fragile-match]: this pattern-matching is fragile.
- It will remain exhaustive when constructors are added to type Hier.file_entry.
- File "obuild/build.ml", line 340, characters 71-75:
- 340 |     (satisfy_all current_pkg) && (List.for_all satisfy_all current_pkg.subs) in
-                                                                              ^^^^
- Warning 40 [name-out-of-scope]: subs was selected from type Meta.Pkg.t.
- It is not visible in the current scope, and will not 
- be selected if the type becomes unknown.
- File "obuild/build.ml", line 340, characters 71-75:
- 340 |     (satisfy_all current_pkg) && (List.for_all satisfy_all current_pkg.subs) in
-                                                                              ^^^^
- Warning 42 [disambiguated-name]: this use of subs relies on type-directed disambiguation,
- it will not compile with OCaml 4.00 or earlier.
- File "obuild/build.ml", line 339, characters 10-26:
- 339 |   let rec dep_is_satisfied current_pkg =
-                 ^^^^^^^^^^^^^^^^
- Warning 39 [unused-rec-flag]: unused rec flag.
- File "obuild/build.ml", lines 363-365, characters 22-24:
- 363 | ......................match compileOpt with
- 364 |             | WithProf -> Meta.Predicate.Gprof :: preds
- 365 |             | _ -> preds
- Warning 4 [fragile-match]: this pattern-matching is fragile.
- It will remain exhaustive when constructors are added to type Types.ocaml_compilation_option.
- File "obuild/build.ml", lines 377-385, characters 13-58:
- 377 | .............match target.target_name with
- 378 |     | Name.Lib libname ->
- 379 |       if plugin then
- 380 |         cstate.compilation_builddir_ml Normal </> Libname.to_cmxs compileOpt libname
- 381 |       else
- 382 |         cstate.compilation_builddir_ml Normal </> Libname.to_cmca compiledType compileOpt libname
- 383 |     | _ ->
- 384 |       let outputName = Utils.to_exe_name compileOpt compiledType (Target.get_target_dest_name target) in
- 385 |       cstate.compilation_builddir_ml Normal </> outputName
- Warning 4 [fragile-match]: this pattern-matching is fragile.
- It will remain exhaustive when constructors are added to type Target.Name.t.
- File "obuild/build.ml", lines 498-500, characters 40-51:
- 498 | ........................................match task with
- 499 |        | CompileC _ -> raise (CCompilationFailed er)
- 500 |        | _          -> raise (CompilationFailed er)
- Warning 4 [fragile-match]: this pattern-matching is fragile.
- It will remain exhaustive when constructors are added to type Prepare.compile_step.
- File "obuild/build.ml", line 1:
- Warning 70 [missing-mli]: Cannot find interface file.
- File "obuild/build.ml", line 333, characters 28-34:
- 333 |         List.fold_left (fun in_acc lib ->
-                                   ^^^^^^
- Warning 27 [unused-var-strict]: unused variable in_acc.
- 
- [39 of 57] Compiling Obuild.Exception              
- File "obuild/exception.ml", line 1:
- Warning 70 [missing-mli]: Cannot find interface file.
- 
- [40 of 57] Packing Obuild                        
- [41 of 57] Linking library dist/build/lib-obuild/obuild.cmxa
- [41 of 57] Linking library dist/build/lib-obuild/obuild.cmxs
- [41 of 57] Linking library dist/build/lib-obuild/obuild.cma
- [42 of 57] Checking dist/build/lib-obuild
- [43 of 57] Compiling Assimilate_oasis              
- [44 of 57] Compiling Simple                        
- File "tools/assimilate_oasis.ml", line 1:
- Warning 70 [missing-mli]: Cannot find interface file.
- 
- [45 of 57] Compiling Install                       
- File "src/simple.ml", line 1:
- Warning 70 [missing-mli]: Cannot find interface file.
- 
- [46 of 57] Compiling Doc                           
- File "src/install.ml", lines 21-24, characters 6-35:
- 21 | ......match Filetype.of_filepath (build_dir </> f) with
- 22 |       | Filetype.FileCMX | Filetype.FileCMI | Filetype.FileA | Filetype.FileCMXS
- 23 |       | Filetype.FileCMXA | Filetype.FileCMA | Filetype.FileCMT | Filetype.FileCMTI -> true
- 24 |       | _                  -> false.
- Warning 4 [fragile-match]: this pattern-matching is fragile.
- It will remain exhaustive when constructors are added to type Obuild.Filetype.t.
- File "src/install.ml", lines 27-29, characters 4-31:
- 27 | ....match Filetype.of_filepath (build_dir </> f) with
- 28 |     | Filetype.FileEXE -> true
- 29 |     | _                -> false.
- Warning 4 [fragile-match]: this pattern-matching is fragile.
- It will remain exhaustive when constructors are added to type Obuild.Filetype.t.
- File "src/install.ml", lines 43-44, characters 31-76:
- 43 | ...............................match target.target_name with
- 44 |           | Name.Lib _ -> print_target_files target list_lib_files | _ -> ()..............
- Warning 4 [fragile-match]: this pattern-matching is fragile.
- It will remain exhaustive when constructors are added to type Obuild.Target.Name.t.
- File "src/install.ml", lines 47-48, characters 31-76:
- 47 | ...............................match target.target_name with
- 48 |           | Name.Exe _ -> print_target_files target list_exe_files | _ -> ()..............
- Warning 4 [fragile-match]: this pattern-matching is fragile.
- It will remain exhaustive when constructors are added to type Obuild.Target.Name.t.
- File "src/install.ml", line 1:
- Warning 70 [missing-mli]: Cannot find interface file.
- 
- [47 of 57] Compiling Sdist                         
- File "src/doc.ml", line 1:
- Warning 70 [missing-mli]: Cannot find interface file.
- File "src/doc.ml", line 15, characters 8-16:
- 15 | let run projFile =
-              ^^^^^^^^
- Warning 27 [unused-var-strict]: unused variable projFile.
- 
- [48 of 57] Compiling Help                          
- File "src/help.ml", line 1:
- Warning 70 [missing-mli]: Cannot find interface file.
- 
- [49 of 57] Compiling Path_generated                
- File "src/sdist.ml", lines 28-30, characters 14-38:
- 28 | ..............match Filetype.of_filepath fpath with
- 29 |               | Filetype.FileML | Filetype.FileMLI -> Filesystem.copy_to_dir fpath dest
- 30 |               | _                -> ()
- Warning 4 [fragile-match]: this pattern-matching is fragile.
- It will remain exhaustive when constructors are added to type Obuild.Filetype.t.
- File "src/sdist.ml", lines 36-38, characters 12-21:
- 36 | ............match Filetype.of_filepath fpath with
- 37 |             | Filetype.FileC | Filetype.FileH -> Filesystem.copy_to_dir fpath dest
- 38 |             | _ -> ()
- Warning 4 [fragile-match]: this pattern-matching is fragile.
- It will remain exhaustive when constructors are added to type Obuild.Filetype.t.
- File "src/sdist.ml", line 1:
- Warning 70 [missing-mli]: Cannot find interface file.
- File "src/sdist.ml", line 9, characters 17-27:
- 9 | let run projFile isSnapshot =
-                      ^^^^^^^^^^
- Warning 27 [unused-var-strict]: unused variable isSnapshot.
- 
- [50 of 57] Compiling Init                          
- File "dist/build/autogen/path_generated.ml", line 1:
- Warning 70 [missing-mli]: Cannot find interface file.
- 
- [51 of 57] Linking executable dist/build/obuild-from-oasis/obuild-from-oasis
- File "src/init.ml", line 1:
- Warning 70 [missing-mli]: Cannot find interface file.
- 
- [52 of 57] Linking executable dist/build/obuild-simple/obuild-simple
- [53 of 57] Compiling Main                          
- [54 of 57] Checking dist/build/obuild-from-oasis
- [55 of 57] Checking dist/build/obuild-simple
- File "src/main.ml", line 1:
- Warning 70 [missing-mli]: Cannot find interface file.
- 
- [56 of 57] Linking executable dist/build/obuild/obuild
- [57 of 57] Checking dist/build/obuild
- 
- real	0m4.030s
- user	0m3.461s
- sys	0m1.435s
-> compiled  obuild.0.1.11
Processing 56/78: [lwt: dune exec] [ocamlbuild: make check-if-preinstalled] [solo5-bindings-hvt: make]
-> installed obuild.0.1.11
Processing 57/78: [lwt: dune exec] [ocamlbuild: make check-if-preinstalled] [solo5-bindings-hvt: make]
Processing 58/78: [bheap: obuild configure] [lwt: dune exec] [ocamlbuild: make check-if-preinstalled] [solo5-bindings-hvt: make]
- Configuring bheap-1.0...
Processing 58/78: [bheap: obuild build] [lwt: dune exec] [ocamlbuild: make check-if-preinstalled] [solo5-bindings-hvt: make]
Processing 58/78: [bheap: obuild build] [lwt: dune build] [ocamlbuild: make check-if-preinstalled] [solo5-bindings-hvt: make]
- [1 of 4] Intfing Binary_heap                   
- File "_none_", line 1:
- Alert ocaml_deprecated_cli: Setting a warning with a sequence of lowercase or uppercase letters,
- like 'PU', is deprecated.
- Use the equivalent signed form: +P+U.
- Hint: Enabling or disabling a warning by its mnemonic name requires a + or - prefix.
- 
- [2 of 4] Compiling Binary_heap                   
- File "_none_", line 1:
- Alert ocaml_deprecated_cli: Setting a warning with a sequence of lowercase or uppercase letters,
- like 'PU', is deprecated.
- Use the equivalent signed form: +P+U.
- Hint: Enabling or disabling a warning by its mnemonic name requires a + or - prefix.
- File "binary_heap.ml", line 50, characters 13-25:
- 50 |     let d' = Array.create n' d.(0) in
-                   ^^^^^^^^^^^^
- Alert deprecated: Stdlib.Array.create
- Use Array.make/ArrayLabels.make instead.
- File "binary_heap.ml", line 57, characters 16-28:
- 57 |       h.data <- Array.create (- h.size) x; h.size <- 0
-                      ^^^^^^^^^^^^
- Alert deprecated: Stdlib.Array.create
- Use Array.make/ArrayLabels.make instead.
- 
- [3 of 4] Linking library dist/build/lib-bheap/bheap.cmxa
- [3 of 4] Linking library dist/build/lib-bheap/bheap.cmxs
- [3 of 4] Linking library dist/build/lib-bheap/bheap.cma
- [4 of 4] Checking dist/build/lib-bheap
-> compiled  bheap.1.0.0
Processing 58/78: [lwt: dune build] [ocamlbuild: make check-if-preinstalled] [solo5-bindings-hvt: make]
Processing 59/78: [lwt: dune build] [ocamlbuild: make check-if-preinstalled] [solo5-bindings-hvt: make] [bheap: obuild install]
- installing library bheap
-> installed bheap.1.0.0
Processing 59/78: [lwt: dune build] [ocamlbuild: make check-if-preinstalled] [solo5-bindings-hvt: make]
- if test -d /home/opam/.opam/4.14/lib/ocaml/ocamlbuild; then\
-   >&2 echo "ERROR: Preinstalled ocamlbuild detected at"\
-        "/home/opam/.opam/4.14/lib/ocaml/ocamlbuild";\
-   >&2 echo "Installation aborted; if you want to bypass this"\
-         "safety check, pass CHECK_IF_PREINSTALLED=false to make";\
-   exit 2;\
- fi
- ocamlc.opt -w +L -w +R -w +Z -I src -I plugin-lib -I bin -I +unix -safe-string -bin-annot -strict-sequence -c src/const.ml
- ocamlc.opt -w +L -w +R -w +Z -I src -I plugin-lib -I bin -I +unix -safe-string -bin-annot -strict-sequence -c src/loc.mli
- ocamlc.opt -w +L -w +R -w +Z -I src -I plugin-lib -I bin -I +unix -safe-string -bin-annot -strict-sequence -c src/loc.ml
- ocamlc.opt -w +L -w +R -w +Z -I src -I plugin-lib -I bin -I +unix -safe-string -bin-annot -strict-sequence -c src/discard_printf.mli
- ocamlc.opt -w +L -w +R -w +Z -I src -I plugin-lib -I bin -I +unix -safe-string -bin-annot -strict-sequence -c src/discard_printf.ml
- ocamlc.opt -w +L -w +R -w +Z -I src -I plugin-lib -I bin -I +unix -safe-string -bin-annot -strict-sequence -c src/signatures.mli
- ocamlc.opt -w +L -w +R -w +Z -I src -I plugin-lib -I bin -I +unix -safe-string -bin-annot -strict-sequence -c src/my_std.mli
- ocamlc.opt -w +L -w +R -w +Z -I src -I plugin-lib -I bin -I +unix -safe-string -bin-annot -strict-sequence -c src/my_std.ml
- ocamlc.opt -w +L -w +R -w +Z -I src -I plugin-lib -I bin -I +unix -safe-string -bin-annot -strict-sequence -c src/my_unix.mli
- ocamlc.opt -w +L -w +R -w +Z -I src -I plugin-lib -I bin -I +unix -safe-string -bin-annot -strict-sequence -c src/my_unix.ml
- ocamlc.opt -w +L -w +R -w +Z -I src -I plugin-lib -I bin -I +unix -safe-string -bin-annot -strict-sequence -c src/tags.mli
- ocamlc.opt -w +L -w +R -w +Z -I src -I plugin-lib -I bin -I +unix -safe-string -bin-annot -strict-sequence -c src/tags.ml
- ocamlc.opt -w +L -w +R -w +Z -I src -I plugin-lib -I bin -I +unix -safe-string -bin-annot -strict-sequence -c src/display.mli
- ocamlc.opt -w +L -w +R -w +Z -I src -I plugin-lib -I bin -I +unix -safe-string -bin-annot -strict-sequence -c src/display.ml
- ocamlc.opt -w +L -w +R -w +Z -I src -I plugin-lib -I bin -I +unix -safe-string -bin-annot -strict-sequence -c src/log.mli
- ocamlc.opt -w +L -w +R -w +Z -I src -I plugin-lib -I bin -I +unix -safe-string -bin-annot -strict-sequence -c src/log.ml
- ocamlc.opt -w +L -w +R -w +Z -I src -I plugin-lib -I bin -I +unix -safe-string -bin-annot -strict-sequence -c src/shell.mli
- ocamlc.opt -w +L -w +R -w +Z -I src -I plugin-lib -I bin -I +unix -safe-string -bin-annot -strict-sequence -c src/shell.ml
- ocamlc.opt -w +L -w +R -w +Z -I src -I plugin-lib -I bin -I +unix -safe-string -bin-annot -strict-sequence -c src/bool.mli
- ocamlc.opt -w +L -w +R -w +Z -I src -I plugin-lib -I bin -I +unix -safe-string -bin-annot -strict-sequence -c src/bool.ml
- ocamlc.opt -w +L -w +R -w +Z -I src -I plugin-lib -I bin -I +unix -safe-string -bin-annot -strict-sequence -c src/glob_ast.mli
- ocamlc.opt -w +L -w +R -w +Z -I src -I plugin-lib -I bin -I +unix -safe-string -bin-annot -strict-sequence -c src/glob_ast.ml
- ocamllex.opt src/glob_lexer.mll
- 55 states, 419 transitions, table size 2006 bytes
- ocamlc.opt -w +L -w +R -w +Z -I src -I plugin-lib -I bin -I +unix -safe-string -bin-annot -strict-sequence -c src/glob_lexer.mli
- ocamlc.opt -w +L -w +R -w +Z -I src -I plugin-lib -I bin -I +unix -safe-string -bin-annot -strict-sequence -c src/glob_lexer.ml
- ocamlc.opt -w +L -w +R -w +Z -I src -I plugin-lib -I bin -I +unix -safe-string -bin-annot -strict-sequence -c src/glob.mli
- ocamlc.opt -w +L -w +R -w +Z -I src -I plugin-lib -I bin -I +unix -safe-string -bin-annot -strict-sequence -c src/glob.ml
- ocamllex.opt src/lexers.mll
- 251 states, 1051 transitions, table size 5710 bytes
- 4334 additional bytes used for bindings
- ocamlc.opt -w +L -w +R -w +Z -I src -I plugin-lib -I bin -I +unix -safe-string -bin-annot -strict-sequence -c src/lexers.mli
- ocamlc.opt -w +L -w +R -w +Z -I src -I plugin-lib -I bin -I +unix -safe-string -bin-annot -strict-sequence -c src/lexers.ml
- ocamlc.opt -w +L -w +R -w +Z -I src -I plugin-lib -I bin -I +unix -safe-string -bin-annot -strict-sequence -c src/param_tags.mli
- ocamlc.opt -w +L -w +R -w +Z -I src -I plugin-lib -I bin -I +unix -safe-string -bin-annot -strict-sequence -c src/param_tags.ml
- ocamlc.opt -w +L -w +R -w +Z -I src -I plugin-lib -I bin -I +unix -safe-string -bin-annot -strict-sequence -c src/command.mli
- ocamlc.opt -w +L -w +R -w +Z -I src -I plugin-lib -I bin -I +unix -safe-string -bin-annot -strict-sequence -c src/command.ml
- ocamlc.opt -w +L -w +R -w +Z -I src -I plugin-lib -I bin -I +unix -safe-string -bin-annot -strict-sequence -c src/ocamlbuild_config.ml
- ocamlc.opt -w +L -w +R -w +Z -I src -I plugin-lib -I bin -I +unix -safe-string -bin-annot -strict-sequence -c src/ocamlbuild_where.mli
- ocamlc.opt -w +L -w +R -w +Z -I src -I plugin-lib -I bin -I +unix -safe-string -bin-annot -strict-sequence -c src/ocamlbuild_where.ml
- ocamlc.opt -w +L -w +R -w +Z -I src -I plugin-lib -I bin -I +unix -safe-string -bin-annot -strict-sequence -c src/slurp.mli
- ocamlc.opt -w +L -w +R -w +Z -I src -I plugin-lib -I bin -I +unix -safe-string -bin-annot -strict-sequence -c src/slurp.ml
- ocamlc.opt -w +L -w +R -w +Z -I src -I plugin-lib -I bin -I +unix -safe-string -bin-annot -strict-sequence -c src/options.mli
- ocamlc.opt -w +L -w +R -w +Z -I src -I plugin-lib -I bin -I +unix -safe-string -bin-annot -strict-sequence -c src/options.ml
- ocamlc.opt -w +L -w +R -w +Z -I src -I plugin-lib -I bin -I +unix -safe-string -bin-annot -strict-sequence -c src/pathname.mli
- ocamlc.opt -w +L -w +R -w +Z -I src -I plugin-lib -I bin -I +unix -safe-string -bin-annot -strict-sequence -c src/pathname.ml
- ocamlc.opt -w +L -w +R -w +Z -I src -I plugin-lib -I bin -I +unix -safe-string -bin-annot -strict-sequence -c src/configuration.mli
- ocamlc.opt -w +L -w +R -w +Z -I src -I plugin-lib -I bin -I +unix -safe-string -bin-annot -strict-sequence -c src/configuration.ml
- ocamlc.opt -w +L -w +R -w +Z -I src -I plugin-lib -I bin -I +unix -safe-string -bin-annot -strict-sequence -c src/flags.mli
- ocamlc.opt -w +L -w +R -w +Z -I src -I plugin-lib -I bin -I +unix -safe-string -bin-annot -strict-sequence -c src/flags.ml
- ocamlc.opt -w +L -w +R -w +Z -I src -I plugin-lib -I bin -I +unix -safe-string -bin-annot -strict-sequence -c src/hygiene.mli
- ocamlc.opt -w +L -w +R -w +Z -I src -I plugin-lib -I bin -I +unix -safe-string -bin-annot -strict-sequence -c src/hygiene.ml
- ocamlc.opt -w +L -w +R -w +Z -I src -I plugin-lib -I bin -I +unix -safe-string -bin-annot -strict-sequence -c src/digest_cache.mli
- ocamlc.opt -w +L -w +R -w +Z -I src -I plugin-lib -I bin -I +unix -safe-string -bin-annot -strict-sequence -c src/digest_cache.ml
- ocamlc.opt -w +L -w +R -w +Z -I src -I plugin-lib -I bin -I +unix -safe-string -bin-annot -strict-sequence -c src/resource.mli
- ocamlc.opt -w +L -w +R -w +Z -I src -I plugin-lib -I bin -I +unix -safe-string -bin-annot -strict-sequence -c src/resource.ml
- ocamlc.opt -w +L -w +R -w +Z -I src -I plugin-lib -I bin -I +unix -safe-string -bin-annot -strict-sequence -c src/rule.mli
- ocamlc.opt -w +L -w +R -w +Z -I src -I plugin-lib -I bin -I +unix -safe-string -bin-annot -strict-sequence -c src/rule.ml
- ocamlc.opt -w +L -w +R -w +Z -I src -I plugin-lib -I bin -I +unix -safe-string -bin-annot -strict-sequence -c src/solver.mli
- ocamlc.opt -w +L -w +R -w +Z -I src -I plugin-lib -I bin -I +unix -safe-string -bin-annot -strict-sequence -c src/solver.ml
- ocamlc.opt -w +L -w +R -w +Z -I src -I plugin-lib -I bin -I +unix -safe-string -bin-annot -strict-sequence -c src/report.mli
- ocamlc.opt -w +L -w +R -w +Z -I src -I plugin-lib -I bin -I +unix -safe-string -bin-annot -strict-sequence -c src/report.ml
- ocamlc.opt -w +L -w +R -w +Z -I src -I plugin-lib -I bin -I +unix -safe-string -bin-annot -strict-sequence -c src/tools.mli
- ocamlc.opt -w +L -w +R -w +Z -I src -I plugin-lib -I bin -I +unix -safe-string -bin-annot -strict-sequence -c src/tools.ml
- ocamlc.opt -w +L -w +R -w +Z -I src -I plugin-lib -I bin -I +unix -safe-string -bin-annot -strict-sequence -c src/fda.mli
- ocamlc.opt -w +L -w +R -w +Z -I src -I plugin-lib -I bin -I +unix -safe-string -bin-annot -strict-sequence -c src/fda.ml
- ocamlc.opt -w +L -w +R -w +Z -I src -I plugin-lib -I bin -I +unix -safe-string -bin-annot -strict-sequence -c src/findlib.mli
- ocamlc.opt -w +L -w +R -w +Z -I src -I plugin-lib -I bin -I +unix -safe-string -bin-annot -strict-sequence -c src/findlib.ml
- ocamlc.opt -w +L -w +R -w +Z -I src -I plugin-lib -I bin -I +unix -safe-string -bin-annot -strict-sequence -c src/ocaml_arch.mli
- ocamlc.opt -w +L -w +R -w +Z -I src -I plugin-lib -I bin -I +unix -safe-string -bin-annot -strict-sequence -c src/ocaml_arch.ml
- ocamlc.opt -w +L -w +R -w +Z -I src -I plugin-lib -I bin -I +unix -safe-string -bin-annot -strict-sequence -c src/ocaml_utils.mli
- ocamlc.opt -w +L -w +R -w +Z -I src -I plugin-lib -I bin -I +unix -safe-string -bin-annot -strict-sequence -c src/ocaml_utils.ml
- ocamlc.opt -w +L -w +R -w +Z -I src -I plugin-lib -I bin -I +unix -safe-string -bin-annot -strict-sequence -c src/ocaml_dependencies.mli
- ocamlc.opt -w +L -w +R -w +Z -I src -I plugin-lib -I bin -I +unix -safe-string -bin-annot -strict-sequence -c src/ocaml_dependencies.ml
- ocamlc.opt -w +L -w +R -w +Z -I src -I plugin-lib -I bin -I +unix -safe-string -bin-annot -strict-sequence -c src/ocaml_compiler.mli
- ocamlc.opt -w +L -w +R -w +Z -I src -I plugin-lib -I bin -I +unix -safe-string -bin-annot -strict-sequence -c src/ocaml_compiler.ml
- ocamlc.opt -w +L -w +R -w +Z -I src -I plugin-lib -I bin -I +unix -safe-string -bin-annot -strict-sequence -c src/ocaml_tools.mli
- ocamlc.opt -w +L -w +R -w +Z -I src -I plugin-lib -I bin -I +unix -safe-string -bin-annot -strict-sequence -c src/ocaml_tools.ml
- ocamlc.opt -w +L -w +R -w +Z -I src -I plugin-lib -I bin -I +unix -safe-string -bin-annot -strict-sequence -c src/ocaml_specific.mli
- ocamlc.opt -w +L -w +R -w +Z -I src -I plugin-lib -I bin -I +unix -safe-string -bin-annot -strict-sequence -c src/ocaml_specific.ml
- ocamlc.opt -w +L -w +R -w +Z -I src -I plugin-lib -I bin -I +unix -safe-string -bin-annot -strict-sequence -c src/exit_codes.mli
- ocamlc.opt -w +L -w +R -w +Z -I src -I plugin-lib -I bin -I +unix -safe-string -bin-annot -strict-sequence -c src/exit_codes.ml
- ocamlc.opt -w +L -w +R -w +Z -I src -I plugin-lib -I bin -I +unix -safe-string -bin-annot -strict-sequence -c src/plugin.mli
- ocamlc.opt -w +L -w +R -w +Z -I src -I plugin-lib -I bin -I +unix -safe-string -bin-annot -strict-sequence -c src/plugin.ml
- ocamlc.opt -w +L -w +R -w +Z -I src -I plugin-lib -I bin -I +unix -safe-string -bin-annot -strict-sequence -c src/hooks.mli
- ocamlc.opt -w +L -w +R -w +Z -I src -I plugin-lib -I bin -I +unix -safe-string -bin-annot -strict-sequence -c src/hooks.ml
- ocamlc.opt -w +L -w +R -w +Z -I src -I plugin-lib -I bin -I +unix -safe-string -bin-annot -strict-sequence -c src/main.mli
- ocamlc.opt -w +L -w +R -w +Z -I src -I plugin-lib -I bin -I +unix -safe-string -bin-annot -strict-sequence -c src/main.ml
- mkdir -p tmp
- ocamlc.opt -pack src/const.cmo src/loc.cmo src/discard_printf.cmo src/signatures.cmi src/my_std.cmo src/my_unix.cmo src/tags.cmo src/display.cmo src/log.cmo src/shell.cmo src/bool.cmo src/glob_ast.cmo src/glob_lexer.cmo src/glob.cmo src/lexers.cmo src/param_tags.cmo src/command.cmo src/ocamlbuild_config.cmo src/ocamlbuild_where.cmo src/slurp.cmo src/options.cmo src/pathname.cmo src/configuration.cmo src/flags.cmo src/hygiene.cmo src/digest_cache.cmo src/resource.cmo src/rule.cmo src/solver.cmo src/report.cmo src/tools.cmo src/fda.cmo src/findlib.cmo src/ocaml_arch.cmo src/ocaml_utils.cmo src/ocaml_dependencies.cmo src/ocaml_compiler.cmo src/ocaml_tools.cmo src/ocaml_specific.cmo src/exit_codes.cmo src/plugin.cmo src/hooks.cmo src/main.cmo -o tmp/ocamlbuild_pack.cmo
- mv tmp/ocamlbuild_pack.cmi src/ocamlbuild_pack.cmi
- mv tmp/ocamlbuild_pack.cmo src/ocamlbuild_pack.cmo
- ocamlc.opt -w +L -w +R -w +Z -I src -I plugin-lib -I bin -I +unix -safe-string -bin-annot -strict-sequence -c plugin-lib/ocamlbuild_plugin.mli
- ocamlc.opt -w +L -w +R -w +Z -I src -I plugin-lib -I bin -I +unix -safe-string -bin-annot -strict-sequence -c plugin-lib/ocamlbuild_plugin.ml
- ocamlc.opt -w +L -w +R -w +Z -I src -I plugin-lib -I bin -I +unix -safe-string -bin-annot -strict-sequence -c plugin-lib/ocamlbuild_executor.mli
- ocamlc.opt -w +L -w +R -w +Z -I src -I plugin-lib -I bin -I +unix -safe-string -bin-annot -strict-sequence -c plugin-lib/ocamlbuild_executor.ml
- ocamlc.opt -w +L -w +R -w +Z -I src -I plugin-lib -I bin -I +unix -safe-string -bin-annot -strict-sequence -c plugin-lib/ocamlbuild_unix_plugin.mli
- ocamlc.opt -w +L -w +R -w +Z -I src -I plugin-lib -I bin -I +unix -safe-string -bin-annot -strict-sequence -c plugin-lib/ocamlbuild_unix_plugin.ml
- ocamlc.opt -w +L -w +R -w +Z -I src -I plugin-lib -I bin -I +unix -safe-string -bin-annot -strict-sequence -c bin/ocamlbuild.mli
- ocamlc.opt -w +L -w +R -w +Z -I src -I plugin-lib -I bin -I +unix -safe-string -bin-annot -strict-sequence -c bin/ocamlbuild.ml
- ocamlc.opt -I +unix -I src -o ocamlbuild.byte unix.cma src/ocamlbuild_pack.cmo plugin-lib/ocamlbuild_plugin.cmo plugin-lib/ocamlbuild_executor.cmo plugin-lib/ocamlbuild_unix_plugin.cmo bin/ocamlbuild.cmo
- ocamlc.opt -a -o plugin-lib/ocamlbuildlib.cma src/ocamlbuild_pack.cmo plugin-lib/ocamlbuild_plugin.cmo plugin-lib/ocamlbuild_executor.cmo plugin-lib/ocamlbuild_unix_plugin.cmo
- ocamlopt.opt -for-pack Ocamlbuild_pack -w +L -w +R -w +Z -I src -I plugin-lib -I bin -I +unix -safe-string -bin-annot -strict-sequence -c src/const.ml
- ocamlopt.opt -for-pack Ocamlbuild_pack -w +L -w +R -w +Z -I src -I plugin-lib -I bin -I +unix -safe-string -bin-annot -strict-sequence -c src/loc.ml
- ocamlopt.opt -for-pack Ocamlbuild_pack -w +L -w +R -w +Z -I src -I plugin-lib -I bin -I +unix -safe-string -bin-annot -strict-sequence -c src/discard_printf.ml
- ocamlopt.opt -for-pack Ocamlbuild_pack -w +L -w +R -w +Z -I src -I plugin-lib -I bin -I +unix -safe-string -bin-annot -strict-sequence -c src/my_std.ml
- ocamlopt.opt -for-pack Ocamlbuild_pack -w +L -w +R -w +Z -I src -I plugin-lib -I bin -I +unix -safe-string -bin-annot -strict-sequence -c src/my_unix.ml
- ocamlopt.opt -for-pack Ocamlbuild_pack -w +L -w +R -w +Z -I src -I plugin-lib -I bin -I +unix -safe-string -bin-annot -strict-sequence -c src/tags.ml
- ocamlopt.opt -for-pack Ocamlbuild_pack -w +L -w +R -w +Z -I src -I plugin-lib -I bin -I +unix -safe-string -bin-annot -strict-sequence -c src/display.ml
- ocamlopt.opt -for-pack Ocamlbuild_pack -w +L -w +R -w +Z -I src -I plugin-lib -I bin -I +unix -safe-string -bin-annot -strict-sequence -c src/log.ml
- ocamlopt.opt -for-pack Ocamlbuild_pack -w +L -w +R -w +Z -I src -I plugin-lib -I bin -I +unix -safe-string -bin-annot -strict-sequence -c src/shell.ml
- ocamlopt.opt -for-pack Ocamlbuild_pack -w +L -w +R -w +Z -I src -I plugin-lib -I bin -I +unix -safe-string -bin-annot -strict-sequence -c src/bool.ml
- ocamlopt.opt -for-pack Ocamlbuild_pack -w +L -w +R -w +Z -I src -I plugin-lib -I bin -I +unix -safe-string -bin-annot -strict-sequence -c src/glob_ast.ml
- ocamlopt.opt -for-pack Ocamlbuild_pack -w +L -w +R -w +Z -I src -I plugin-lib -I bin -I +unix -safe-string -bin-annot -strict-sequence -c src/glob_lexer.ml
- ocamlopt.opt -for-pack Ocamlbuild_pack -w +L -w +R -w +Z -I src -I plugin-lib -I bin -I +unix -safe-string -bin-annot -strict-sequence -c src/glob.ml
- ocamlopt.opt -for-pack Ocamlbuild_pack -w +L -w +R -w +Z -I src -I plugin-lib -I bin -I +unix -safe-string -bin-annot -strict-sequence -c src/lexers.ml
- ocamlopt.opt -for-pack Ocamlbuild_pack -w +L -w +R -w +Z -I src -I plugin-lib -I bin -I +unix -safe-string -bin-annot -strict-sequence -c src/param_tags.ml
- ocamlopt.opt -for-pack Ocamlbuild_pack -w +L -w +R -w +Z -I src -I plugin-lib -I bin -I +unix -safe-string -bin-annot -strict-sequence -c src/command.ml
- ocamlopt.opt -for-pack Ocamlbuild_pack -w +L -w +R -w +Z -I src -I plugin-lib -I bin -I +unix -safe-string -bin-annot -strict-sequence -c src/ocamlbuild_config.ml
- ocamlopt.opt -for-pack Ocamlbuild_pack -w +L -w +R -w +Z -I src -I plugin-lib -I bin -I +unix -safe-string -bin-annot -strict-sequence -c src/ocamlbuild_where.ml
- ocamlopt.opt -for-pack Ocamlbuild_pack -w +L -w +R -w +Z -I src -I plugin-lib -I bin -I +unix -safe-string -bin-annot -strict-sequence -c src/slurp.ml
- ocamlopt.opt -for-pack Ocamlbuild_pack -w +L -w +R -w +Z -I src -I plugin-lib -I bin -I +unix -safe-string -bin-annot -strict-sequence -c src/options.ml
- ocamlopt.opt -for-pack Ocamlbuild_pack -w +L -w +R -w +Z -I src -I plugin-lib -I bin -I +unix -safe-string -bin-annot -strict-sequence -c src/pathname.ml
- ocamlopt.opt -for-pack Ocamlbuild_pack -w +L -w +R -w +Z -I src -I plugin-lib -I bin -I +unix -safe-string -bin-annot -strict-sequence -c src/configuration.ml
- ocamlopt.opt -for-pack Ocamlbuild_pack -w +L -w +R -w +Z -I src -I plugin-lib -I bin -I +unix -safe-string -bin-annot -strict-sequence -c src/flags.ml
- ocamlopt.opt -for-pack Ocamlbuild_pack -w +L -w +R -w +Z -I src -I plugin-lib -I bin -I +unix -safe-string -bin-annot -strict-sequence -c src/hygiene.ml
- ocamlopt.opt -for-pack Ocamlbuild_pack -w +L -w +R -w +Z -I src -I plugin-lib -I bin -I +unix -safe-string -bin-annot -strict-sequence -c src/digest_cache.ml
- ocamlopt.opt -for-pack Ocamlbuild_pack -w +L -w +R -w +Z -I src -I plugin-lib -I bin -I +unix -safe-string -bin-annot -strict-sequence -c src/resource.ml
- ocamlopt.opt -for-pack Ocamlbuild_pack -w +L -w +R -w +Z -I src -I plugin-lib -I bin -I +unix -safe-string -bin-annot -strict-sequence -c src/rule.ml
- ocamlopt.opt -for-pack Ocamlbuild_pack -w +L -w +R -w +Z -I src -I plugin-lib -I bin -I +unix -safe-string -bin-annot -strict-sequence -c src/solver.ml
- ocamlopt.opt -for-pack Ocamlbuild_pack -w +L -w +R -w +Z -I src -I plugin-lib -I bin -I +unix -safe-string -bin-annot -strict-sequence -c src/report.ml
- ocamlopt.opt -for-pack Ocamlbuild_pack -w +L -w +R -w +Z -I src -I plugin-lib -I bin -I +unix -safe-string -bin-annot -strict-sequence -c src/tools.ml
- ocamlopt.opt -for-pack Ocamlbuild_pack -w +L -w +R -w +Z -I src -I plugin-lib -I bin -I +unix -safe-string -bin-annot -strict-sequence -c src/fda.ml
- ocamlopt.opt -for-pack Ocamlbuild_pack -w +L -w +R -w +Z -I src -I plugin-lib -I bin -I +unix -safe-string -bin-annot -strict-sequence -c src/findlib.ml
- ocamlopt.opt -for-pack Ocamlbuild_pack -w +L -w +R -w +Z -I src -I plugin-lib -I bin -I +unix -safe-string -bin-annot -strict-sequence -c src/ocaml_arch.ml
- ocamlopt.opt -for-pack Ocamlbuild_pack -w +L -w +R -w +Z -I src -I plugin-lib -I bin -I +unix -safe-string -bin-annot -strict-sequence -c src/ocaml_utils.ml
- ocamlopt.opt -for-pack Ocamlbuild_pack -w +L -w +R -w +Z -I src -I plugin-lib -I bin -I +unix -safe-string -bin-annot -strict-sequence -c src/ocaml_dependencies.ml
- ocamlopt.opt -for-pack Ocamlbuild_pack -w +L -w +R -w +Z -I src -I plugin-lib -I bin -I +unix -safe-string -bin-annot -strict-sequence -c src/ocaml_compiler.ml
- ocamlopt.opt -for-pack Ocamlbuild_pack -w +L -w +R -w +Z -I src -I plugin-lib -I bin -I +unix -safe-string -bin-annot -strict-sequence -c src/ocaml_tools.ml
- ocamlopt.opt -for-pack Ocamlbuild_pack -w +L -w +R -w +Z -I src -I plugin-lib -I bin -I +unix -safe-string -bin-annot -strict-sequence -c src/ocaml_specific.ml
- ocamlopt.opt -for-pack Ocamlbuild_pack -w +L -w +R -w +Z -I src -I plugin-lib -I bin -I +unix -safe-string -bin-annot -strict-sequence -c src/exit_codes.ml
- ocamlopt.opt -for-pack Ocamlbuild_pack -w +L -w +R -w +Z -I src -I plugin-lib -I bin -I +unix -safe-string -bin-annot -strict-sequence -c src/plugin.ml
- ocamlopt.opt -for-pack Ocamlbuild_pack -w +L -w +R -w +Z -I src -I plugin-lib -I bin -I +unix -safe-string -bin-annot -strict-sequence -c src/hooks.ml
- ocamlopt.opt -for-pack Ocamlbuild_pack -w +L -w +R -w +Z -I src -I plugin-lib -I bin -I +unix -safe-string -bin-annot -strict-sequence -c src/main.ml
- mkdir -p tmp
- ocamlopt.opt -pack src/const.cmx src/loc.cmx src/discard_printf.cmx src/signatures.cmi src/my_std.cmx src/my_unix.cmx src/tags.cmx src/display.cmx src/log.cmx src/shell.cmx src/bool.cmx src/glob_ast.cmx src/glob_lexer.cmx src/glob.cmx src/lexers.cmx src/param_tags.cmx src/command.cmx src/ocamlbuild_config.cmx src/ocamlbuild_where.cmx src/slurp.cmx src/options.cmx src/pathname.cmx src/configuration.cmx src/flags.cmx src/hygiene.cmx src/digest_cache.cmx src/resource.cmx src/rule.cmx src/solver.cmx src/report.cmx src/tools.cmx src/fda.cmx src/findlib.cmx src/ocaml_arch.cmx src/ocaml_utils.cmx src/ocaml_dependencies.cmx src/ocaml_compiler.cmx src/ocaml_tools.cmx src/ocaml_specific.cmx src/exit_codes.cmx src/plugin.cmx src/hooks.cmx src/main.cmx -o tmp/ocamlbuild_pack.cmx
- mv tmp/ocamlbuild_pack.cmx src/ocamlbuild_pack.cmx
- mv tmp/ocamlbuild_pack.o src/ocamlbuild_pack.o
- ocamlopt.opt -w +L -w +R -w +Z -I src -I plugin-lib -I bin -I +unix -safe-string -bin-annot -strict-sequence -c plugin-lib/ocamlbuild_plugin.ml
- ocamlopt.opt -w +L -w +R -w +Z -I src -I plugin-lib -I bin -I +unix -safe-string -bin-annot -strict-sequence -c plugin-lib/ocamlbuild_executor.ml
- ocamlopt.opt -w +L -w +R -w +Z -I src -I plugin-lib -I bin -I +unix -safe-string -bin-annot -strict-sequence -c plugin-lib/ocamlbuild_unix_plugin.ml
- ocamlopt.opt -w +L -w +R -w +Z -I src -I plugin-lib -I bin -I +unix -safe-string -bin-annot -strict-sequence -c bin/ocamlbuild.ml
- ocamlopt.opt -I +unix -I src -o ocamlbuild.native unix.cmxa src/ocamlbuild_pack.cmx plugin-lib/ocamlbuild_plugin.cmx plugin-lib/ocamlbuild_executor.cmx plugin-lib/ocamlbuild_unix_plugin.cmx bin/ocamlbuild.cmx
- ocamlopt.opt -a -o plugin-lib/ocamlbuildlib.cmxa src/ocamlbuild_pack.cmx plugin-lib/ocamlbuild_plugin.cmx plugin-lib/ocamlbuild_executor.cmx plugin-lib/ocamlbuild_unix_plugin.cmx
- ocamlc.opt src/ocamlbuild_pack.cmo -I src man/options_man.ml -o man/options_man.byte
- ./man/options_man.byte > man/ocamlbuild.options.1
- cat man/ocamlbuild.header.1 man/ocamlbuild.options.1 man/ocamlbuild.footer.1 > man/ocamlbuild.1
- /usr/bin/make ocamlbuild.install
- make[1]: Entering directory '/home/opam/.opam/4.14/.opam-switch/build/ocamlbuild.0.14.3'
- rm -f ocamlbuild.install
- touch ocamlbuild.install
- /usr/bin/make install-bin-opam
- make[2]: Entering directory '/home/opam/.opam/4.14/.opam-switch/build/ocamlbuild.0.14.3'
- echo 'bin: [' >> ocamlbuild.install
- echo '  "ocamlbuild.byte" {"ocamlbuild.byte"}' >> ocamlbuild.install
- echo '  "ocamlbuild.native" {"ocamlbuild.native"}' >> ocamlbuild.install
- echo '  "ocamlbuild.native" {"ocamlbuild"}' >> ocamlbuild.install
- echo ']' >> ocamlbuild.install
- echo >> ocamlbuild.install
- make[2]: Leaving directory '/home/opam/.opam/4.14/.opam-switch/build/ocamlbuild.0.14.3'
- /usr/bin/make install-lib-opam
- make[2]: Entering directory '/home/opam/.opam/4.14/.opam-switch/build/ocamlbuild.0.14.3'
- echo 'lib: [' >> ocamlbuild.install
- /usr/bin/make install-lib-basics-opam
- make[3]: Entering directory '/home/opam/.opam/4.14/.opam-switch/build/ocamlbuild.0.14.3'
- echo '  "ocamlbuild.opam" {"opam"}' >> ocamlbuild.install
- echo '  "META"' >> ocamlbuild.install
- for lib in src/signatures.mli src/signatures.cmi src/signatures.cmti; do \
-   echo "  \"$lib\" {\"$(basename $lib)\"}" >> ocamlbuild.install; \
- done
- make[3]: Leaving directory '/home/opam/.opam/4.14/.opam-switch/build/ocamlbuild.0.14.3'
- /usr/bin/make install-lib-byte-opam
- make[3]: Entering directory '/home/opam/.opam/4.14/.opam-switch/build/ocamlbuild.0.14.3'
- for lib in plugin-lib/ocamlbuildlib.cma bin/ocamlbuild.cmo src/ocamlbuild_pack.cmi plugin-lib/ocamlbuild_plugin.cmi plugin-lib/ocamlbuild_executor.cmi plugin-lib/ocamlbuild_unix_plugin.cmi; do \
-   echo "  \"$lib\" {\"$(basename $lib)\"}" >> ocamlbuild.install; \
- done
- make[3]: Leaving directory '/home/opam/.opam/4.14/.opam-switch/build/ocamlbuild.0.14.3'
- /usr/bin/make install-lib-native-opam
- make[3]: Entering directory '/home/opam/.opam/4.14/.opam-switch/build/ocamlbuild.0.14.3'
- for lib in plugin-lib/ocamlbuildlib.cmxa plugin-lib/ocamlbuildlib.a bin/ocamlbuild.cmx bin/ocamlbuild.o src/ocamlbuild_pack.cmx plugin-lib/ocamlbuild_plugin.cmx plugin-lib/ocamlbuild_executor.cmx plugin-lib/ocamlbuild_unix_plugin.cmx plugin-lib/ocamlbuild_plugin.o plugin-lib/ocamlbuild_executor.o plugin-lib/ocamlbuild_unix_plugin.o; do \
-   echo "  \"$lib\" {\"$(basename $lib)\"}" >> ocamlbuild.install; \
- done
- make[3]: Leaving directory '/home/opam/.opam/4.14/.opam-switch/build/ocamlbuild.0.14.3'
- echo ']' >> ocamlbuild.install
- echo >> ocamlbuild.install
- make[2]: Leaving directory '/home/opam/.opam/4.14/.opam-switch/build/ocamlbuild.0.14.3'
- /usr/bin/make install-man-opam
- make[2]: Entering directory '/home/opam/.opam/4.14/.opam-switch/build/ocamlbuild.0.14.3'
- echo 'man: [' >> ocamlbuild.install
- echo '  "man/ocamlbuild.1" {"man1/ocamlbuild.1"}' >> ocamlbuild.install
- echo ']' >> ocamlbuild.install
- echo >> ocamlbuild.install
- make[2]: Leaving directory '/home/opam/.opam/4.14/.opam-switch/build/ocamlbuild.0.14.3'
- /usr/bin/make install-doc-opam
- make[2]: Entering directory '/home/opam/.opam/4.14/.opam-switch/build/ocamlbuild.0.14.3'
- echo 'doc: [' >> ocamlbuild.install
- echo '  "LICENSE"' >> ocamlbuild.install
- echo '  "Changes"' >> ocamlbuild.install
- echo '  "Readme.md"' >> ocamlbuild.install
- echo ']' >> ocamlbuild.install
- make[2]: Leaving directory '/home/opam/.opam/4.14/.opam-switch/build/ocamlbuild.0.14.3'
- make[1]: Leaving directory '/home/opam/.opam/4.14/.opam-switch/build/ocamlbuild.0.14.3'
-> compiled  ocamlbuild.0.14.3
Processing 59/78: [lwt: dune build] [solo5-bindings-hvt: make]
-> installed ocamlbuild.0.14.3
Processing 60/78: [lwt: dune build] [solo5-bindings-hvt: make]
Processing 61/78: [lwt: dune build] [solo5-bindings-hvt: make] [topkg: ocaml build]
- (cd _build/default && /home/opam/.opam/4.14/bin/ocamlc.opt -w -40 -w +A-29 -g -bin-annot -I src/core/.lwt.objs/byte -intf-suffix .ml -no-alias-deps -o src/core/.lwt.objs/byte/lwt_stream.cmo -c -impl src/core/lwt_stream.ml)
- File "src/core/lwt_stream.ml", line 46, characters 2-55:
- 46 |   mutable push_external : Obj.t [@ocaml.warning "-69"];
-        ^^^^^^^^^^^^^^^^^^^^^^^^^^^^^^^^^^^^^^^^^^^^^^^^^^^^^
- Warning 69 [unused-field]: record field push_external is never read.
- (However, this field is used to build or mutate values.)
- File "src/core/lwt_stream.ml", line 67, characters 2-56:
- 67 |   mutable pushb_external : Obj.t [@ocaml.warning "-69"];
-        ^^^^^^^^^^^^^^^^^^^^^^^^^^^^^^^^^^^^^^^^^^^^^^^^^^^^^^
- Warning 69 [unused-field]: record field pushb_external is never read.
- (However, this field is used to build or mutate values.)
- (cd _build/default && /home/opam/.opam/4.14/bin/ocamlopt.opt -w -40 -w +A-29 -g -I src/core/.lwt.objs/byte -I src/core/.lwt.objs/native -intf-suffix .ml -no-alias-deps -o src/core/.lwt.objs/native/lwt_stream.cmx -c -impl src/core/lwt_stream.ml)
- File "src/core/lwt_stream.ml", line 46, characters 2-55:
- 46 |   mutable push_external : Obj.t [@ocaml.warning "-69"];
-        ^^^^^^^^^^^^^^^^^^^^^^^^^^^^^^^^^^^^^^^^^^^^^^^^^^^^^
- Warning 69 [unused-field]: record field push_external is never read.
- (However, this field is used to build or mutate values.)
- File "src/core/lwt_stream.ml", line 67, characters 2-56:
- 67 |   mutable pushb_external : Obj.t [@ocaml.warning "-69"];
-        ^^^^^^^^^^^^^^^^^^^^^^^^^^^^^^^^^^^^^^^^^^^^^^^^^^^^^^
- Warning 69 [unused-field]: record field pushb_external is never read.
- (However, this field is used to build or mutate values.)
-> compiled  lwt.5.7.0
Processing 61/78: [solo5-bindings-hvt: make] [topkg: ocaml build]
-> installed lwt.5.7.0
Processing 62/78: [solo5-bindings-hvt: make] [topkg: ocaml build]
- GEN include/solo5/solo5_version.h
- scripts/gen_version_h.sh include/solo5/solo5_version.h
- MAKE bindings
- /usr/bin/make -C bindings  
- make[1]: Entering directory '/home/opam/.opam/4.14/.opam-switch/build/solo5-bindings-hvt.0.6.9/bindings'
- CC hvt/start.o
- cc -MT hvt/start.o -MMD -MP -MF hvt/start.Td -std=c11 -Wall -Wextra -Werror -O2 -g -ffreestanding -fstack-protector-strong -nostdinc -mstack-protector-guard=global -mno-sse -mno-mmx -mno-aes -mno-avx -mno-red-zone -isystem /home/opam/.opam/4.14/.opam-switch/build/solo5-bindings-hvt.0.6.9/include/crt -I/home/opam/.opam/4.14/.opam-switch/build/solo5-bindings-hvt.0.6.9/include/solo5 -D__SOLO5_BINDINGS__ -c hvt/start.c -o hvt/start.o
- mv -f hvt/start.Td hvt/start.d && touch hvt/start.o
- CC abort.o
- cc -MT abort.o -MMD -MP -MF abort.Td -std=c11 -Wall -Wextra -Werror -O2 -g -ffreestanding -fstack-protector-strong -nostdinc -mstack-protector-guard=global -mno-sse -mno-mmx -mno-aes -mno-avx -mno-red-zone -isystem /home/opam/.opam/4.14/.opam-switch/build/solo5-bindings-hvt.0.6.9/include/crt -I/home/opam/.opam/4.14/.opam-switch/build/solo5-bindings-hvt.0.6.9/include/solo5 -D__SOLO5_BINDINGS__ -c abort.c -o abort.o
- mv -f abort.Td abort.d && touch abort.o
- CC cpu_x86_64.o
- cc -MT cpu_x86_64.o -MMD -MP -MF cpu_x86_64.Td -std=c11 -Wall -Wextra -Werror -O2 -g -ffreestanding -fstack-protector-strong -nostdinc -mstack-protector-guard=global -mno-sse -mno-mmx -mno-aes -mno-avx -mno-red-zone -isystem /home/opam/.opam/4.14/.opam-switch/build/solo5-bindings-hvt.0.6.9/include/crt -I/home/opam/.opam/4.14/.opam-switch/build/solo5-bindings-hvt.0.6.9/include/solo5 -D__SOLO5_BINDINGS__ -c cpu_x86_64.c -o cpu_x86_64.o
- mv -f cpu_x86_64.Td cpu_x86_64.d && touch cpu_x86_64.o
- AS cpu_vectors_x86_64.o
- cc -MT cpu_vectors_x86_64.o -MMD -MP -MF cpu_vectors_x86_64.Td -std=c11 -Wall -Wextra -Werror -O2 -g -ffreestanding -fstack-protector-strong -nostdinc -mstack-protector-guard=global -mno-sse -mno-mmx -mno-aes -mno-avx -mno-red-zone -isystem /home/opam/.opam/4.14/.opam-switch/build/solo5-bindings-hvt.0.6.9/include/crt -I/home/opam/.opam/4.14/.opam-switch/build/solo5-bindings-hvt.0.6.9/include/solo5 -D__SOLO5_BINDINGS__ -DASM_FILE -c cpu_vectors_x86_64.S -o cpu_vectors_x86_64.o
- mv -f cpu_vectors_x86_64.Td cpu_vectors_x86_64.d && touch cpu_vectors_x86_64.o
- CC crt.o
- cc -MT crt.o -MMD -MP -MF crt.Td -std=c11 -Wall -Wextra -Werror -O2 -g -ffreestanding -fstack-protector-strong -nostdinc -mstack-protector-guard=global -mno-sse -mno-mmx -mno-aes -mno-avx -mno-red-zone -isystem /home/opam/.opam/4.14/.opam-switch/build/solo5-bindings-hvt.0.6.9/include/crt -I/home/opam/.opam/4.14/.opam-switch/build/solo5-bindings-hvt.0.6.9/include/solo5 -D__SOLO5_BINDINGS__ -c crt.c -o crt.o
- mv -f crt.Td crt.d && touch crt.o
- CC printf.o
- cc -MT printf.o -MMD -MP -MF printf.Td -std=c11 -Wall -Wextra -Werror -O2 -g -ffreestanding -fstack-protector-strong -nostdinc -mstack-protector-guard=global -mno-sse -mno-mmx -mno-aes -mno-avx -mno-red-zone -isystem /home/opam/.opam/4.14/.opam-switch/build/solo5-bindings-hvt.0.6.9/include/crt -I/home/opam/.opam/4.14/.opam-switch/build/solo5-bindings-hvt.0.6.9/include/solo5 -D__SOLO5_BINDINGS__ -c printf.c -o printf.o
- mv -f printf.Td printf.d && touch printf.o
- CC intr.o
- cc -MT intr.o -MMD -MP -MF intr.Td -std=c11 -Wall -Wextra -Werror -O2 -g -ffreestanding -fstack-protector-strong -nostdinc -mstack-protector-guard=global -mno-sse -mno-mmx -mno-aes -mno-avx -mno-red-zone -isystem /home/opam/.opam/4.14/.opam-switch/build/solo5-bindings-hvt.0.6.9/include/crt -I/home/opam/.opam/4.14/.opam-switch/build/solo5-bindings-hvt.0.6.9/include/solo5 -D__SOLO5_BINDINGS__ -c intr.c -o intr.o
- mv -f intr.Td intr.d && touch intr.o
- CC lib.o
- cc -MT lib.o -MMD -MP -MF lib.Td -std=c11 -Wall -Wextra -Werror -O2 -g -ffreestanding -fstack-protector-strong -nostdinc -mstack-protector-guard=global -mno-sse -mno-mmx -mno-aes -mno-avx -mno-red-zone -isystem /home/opam/.opam/4.14/.opam-switch/build/solo5-bindings-hvt.0.6.9/include/crt -I/home/opam/.opam/4.14/.opam-switch/build/solo5-bindings-hvt.0.6.9/include/solo5 -D__SOLO5_BINDINGS__ -c lib.c -o lib.o
- mv -f lib.Td lib.d && touch lib.o
- CC mem.o
- cc -MT mem.o -MMD -MP -MF mem.Td -std=c11 -Wall -Wextra -Werror -O2 -g -ffreestanding -fstack-protector-strong -nostdinc -mstack-protector-guard=global -mno-sse -mno-mmx -mno-aes -mno-avx -mno-red-zone -isystem /home/opam/.opam/4.14/.opam-switch/build/solo5-bindings-hvt.0.6.9/include/crt -I/home/opam/.opam/4.14/.opam-switch/build/solo5-bindings-hvt.0.6.9/include/solo5 -D__SOLO5_BINDINGS__ -c mem.c -o mem.o
- mv -f mem.Td mem.d && touch mem.o
- CC exit.o
- cc -MT exit.o -MMD -MP -MF exit.Td -std=c11 -Wall -Wextra -Werror -O2 -g -ffreestanding -fstack-protector-strong -nostdinc -mstack-protector-guard=global -mno-sse -mno-mmx -mno-aes -mno-avx -mno-red-zone -isystem /home/opam/.opam/4.14/.opam-switch/build/solo5-bindings-hvt.0.6.9/include/crt -I/home/opam/.opam/4.14/.opam-switch/build/solo5-bindings-hvt.0.6.9/include/solo5 -D__SOLO5_BINDINGS__ -c exit.c -o exit.o
- mv -f exit.Td exit.d && touch exit.o
- CC log.o
- cc -MT log.o -MMD -MP -MF log.Td -std=c11 -Wall -Wextra -Werror -O2 -g -ffreestanding -fstack-protector-strong -nostdinc -mstack-protector-guard=global -mno-sse -mno-mmx -mno-aes -mno-avx -mno-red-zone -isystem /home/opam/.opam/4.14/.opam-switch/build/solo5-bindings-hvt.0.6.9/include/crt -I/home/opam/.opam/4.14/.opam-switch/build/solo5-bindings-hvt.0.6.9/include/solo5 -D__SOLO5_BINDINGS__ -c log.c -o log.o
- mv -f log.Td log.d && touch log.o
- CC cmdline.o
- cc -MT cmdline.o -MMD -MP -MF cmdline.Td -std=c11 -Wall -Wextra -Werror -O2 -g -ffreestanding -fstack-protector-strong -nostdinc -mstack-protector-guard=global -mno-sse -mno-mmx -mno-aes -mno-avx -mno-red-zone -isystem /home/opam/.opam/4.14/.opam-switch/build/solo5-bindings-hvt.0.6.9/include/crt -I/home/opam/.opam/4.14/.opam-switch/build/solo5-bindings-hvt.0.6.9/include/solo5 -D__SOLO5_BINDINGS__ -c cmdline.c -o cmdline.o
- mv -f cmdline.Td cmdline.d && touch cmdline.o
- CC tls.o
- cc -MT tls.o -MMD -MP -MF tls.Td -std=c11 -Wall -Wextra -Werror -O2 -g -ffreestanding -fstack-protector-strong -nostdinc -mstack-protector-guard=global -mno-sse -mno-mmx -mno-aes -mno-avx -mno-red-zone -isystem /home/opam/.opam/4.14/.opam-switch/build/solo5-bindings-hvt.0.6.9/include/crt -I/home/opam/.opam/4.14/.opam-switch/build/solo5-bindings-hvt.0.6.9/include/solo5 -D__SOLO5_BINDINGS__ -c tls.c -o tls.o
- mv -f tls.Td tls.d && touch tls.o
- CC mft.o
- cc -MT mft.o -MMD -MP -MF mft.Td -std=c11 -Wall -Wextra -Werror -O2 -g -ffreestanding -fstack-protector-strong -nostdinc -mstack-protector-guard=global -mno-sse -mno-mmx -mno-aes -mno-avx -mno-red-zone -isystem /home/opam/.opam/4.14/.opam-switch/build/solo5-bindings-hvt.0.6.9/include/crt -I/home/opam/.opam/4.14/.opam-switch/build/solo5-bindings-hvt.0.6.9/include/solo5 -D__SOLO5_BINDINGS__ -c mft.c -o mft.o
- mv -f mft.Td mft.d && touch mft.o
- CC hvt/platform.o
- cc -MT hvt/platform.o -MMD -MP -MF hvt/platform.Td -std=c11 -Wall -Wextra -Werror -O2 -g -ffreestanding -fstack-protector-strong -nostdinc -mstack-protector-guard=global -mno-sse -mno-mmx -mno-aes -mno-avx -mno-red-zone -isystem /home/opam/.opam/4.14/.opam-switch/build/solo5-bindings-hvt.0.6.9/include/crt -I/home/opam/.opam/4.14/.opam-switch/build/solo5-bindings-hvt.0.6.9/include/solo5 -D__SOLO5_BINDINGS__ -c hvt/platform.c -o hvt/platform.o
- mv -f hvt/platform.Td hvt/platform.d && touch hvt/platform.o
- CC hvt/platform_intr.o
- cc -MT hvt/platform_intr.o -MMD -MP -MF hvt/platform_intr.Td -std=c11 -Wall -Wextra -Werror -O2 -g -ffreestanding -fstack-protector-strong -nostdinc -mstack-protector-guard=global -mno-sse -mno-mmx -mno-aes -mno-avx -mno-red-zone -isystem /home/opam/.opam/4.14/.opam-switch/build/solo5-bindings-hvt.0.6.9/include/crt -I/home/opam/.opam/4.14/.opam-switch/build/solo5-bindings-hvt.0.6.9/include/solo5 -D__SOLO5_BINDINGS__ -c hvt/platform_intr.c -o hvt/platform_intr.o
- mv -f hvt/platform_intr.Td hvt/platform_intr.d && touch hvt/platform_intr.o
- CC hvt/time.o
- cc -MT hvt/time.o -MMD -MP -MF hvt/time.Td -std=c11 -Wall -Wextra -Werror -O2 -g -ffreestanding -fstack-protector-strong -nostdinc -mstack-protector-guard=global -mno-sse -mno-mmx -mno-aes -mno-avx -mno-red-zone -isystem /home/opam/.opam/4.14/.opam-switch/build/solo5-bindings-hvt.0.6.9/include/crt -I/home/opam/.opam/4.14/.opam-switch/build/solo5-bindings-hvt.0.6.9/include/solo5 -D__SOLO5_BINDINGS__ -c hvt/time.c -o hvt/time.o
- mv -f hvt/time.Td hvt/time.d && touch hvt/time.o
- CC hvt/platform_lifecycle.o
- cc -MT hvt/platform_lifecycle.o -MMD -MP -MF hvt/platform_lifecycle.Td -std=c11 -Wall -Wextra -Werror -O2 -g -ffreestanding -fstack-protector-strong -nostdinc -mstack-protector-guard=global -mno-sse -mno-mmx -mno-aes -mno-avx -mno-red-zone -isystem /home/opam/.opam/4.14/.opam-switch/build/solo5-bindings-hvt.0.6.9/include/crt -I/home/opam/.opam/4.14/.opam-switch/build/solo5-bindings-hvt.0.6.9/include/solo5 -D__SOLO5_BINDINGS__ -c hvt/platform_lifecycle.c -o hvt/platform_lifecycle.o
- mv -f hvt/platform_lifecycle.Td hvt/platform_lifecycle.d && touch hvt/platform_lifecycle.o
- CC hvt/yield.o
- cc -MT hvt/yield.o -MMD -MP -MF hvt/yield.Td -std=c11 -Wall -Wextra -Werror -O2 -g -ffreestanding -fstack-protector-strong -nostdinc -mstack-protector-guard=global -mno-sse -mno-mmx -mno-aes -mno-avx -mno-red-zone -isystem /home/opam/.opam/4.14/.opam-switch/build/solo5-bindings-hvt.0.6.9/include/crt -I/home/opam/.opam/4.14/.opam-switch/build/solo5-bindings-hvt.0.6.9/include/solo5 -D__SOLO5_BINDINGS__ -c hvt/yield.c -o hvt/yield.o
- mv -f hvt/yield.Td hvt/yield.d && touch hvt/yield.o
- CC hvt/tscclock.o
- cc -MT hvt/tscclock.o -MMD -MP -MF hvt/tscclock.Td -std=c11 -Wall -Wextra -Werror -O2 -g -ffreestanding -fstack-protector-strong -nostdinc -mstack-protector-guard=global -mno-sse -mno-mmx -mno-aes -mno-avx -mno-red-zone -isystem /home/opam/.opam/4.14/.opam-switch/build/solo5-bindings-hvt.0.6.9/include/crt -I/home/opam/.opam/4.14/.opam-switch/build/solo5-bindings-hvt.0.6.9/include/solo5 -D__SOLO5_BINDINGS__ -c hvt/tscclock.c -o hvt/tscclock.o
- mv -f hvt/tscclock.Td hvt/tscclock.d && touch hvt/tscclock.o
- CC hvt/console.o
- cc -MT hvt/console.o -MMD -MP -MF hvt/console.Td -std=c11 -Wall -Wextra -Werror -O2 -g -ffreestanding -fstack-protector-strong -nostdinc -mstack-protector-guard=global -mno-sse -mno-mmx -mno-aes -mno-avx -mno-red-zone -isystem /home/opam/.opam/4.14/.opam-switch/build/solo5-bindings-hvt.0.6.9/include/crt -I/home/opam/.opam/4.14/.opam-switch/build/solo5-bindings-hvt.0.6.9/include/solo5 -D__SOLO5_BINDINGS__ -c hvt/console.c -o hvt/console.o
- mv -f hvt/console.Td hvt/console.d && touch hvt/console.o
- CC hvt/net.o
- cc -MT hvt/net.o -MMD -MP -MF hvt/net.Td -std=c11 -Wall -Wextra -Werror -O2 -g -ffreestanding -fstack-protector-strong -nostdinc -mstack-protector-guard=global -mno-sse -mno-mmx -mno-aes -mno-avx -mno-red-zone -isystem /home/opam/.opam/4.14/.opam-switch/build/solo5-bindings-hvt.0.6.9/include/crt -I/home/opam/.opam/4.14/.opam-switch/build/solo5-bindings-hvt.0.6.9/include/solo5 -D__SOLO5_BINDINGS__ -c hvt/net.c -o hvt/net.o
- mv -f hvt/net.Td hvt/net.d && touch hvt/net.o
- CC hvt/block.o
- cc -MT hvt/block.o -MMD -MP -MF hvt/block.Td -std=c11 -Wall -Wextra -Werror -O2 -g -ffreestanding -fstack-protector-strong -nostdinc -mstack-protector-guard=global -mno-sse -mno-mmx -mno-aes -mno-avx -mno-red-zone -isystem /home/opam/.opam/4.14/.opam-switch/build/solo5-bindings-hvt.0.6.9/include/crt -I/home/opam/.opam/4.14/.opam-switch/build/solo5-bindings-hvt.0.6.9/include/solo5 -D__SOLO5_BINDINGS__ -c hvt/block.c -o hvt/block.o
- mv -f hvt/block.Td hvt/block.d && touch hvt/block.o
- LD hvt/solo5_hvt.o
- ld -r -nostdlib -z max-page-size=0x1000 -static  hvt/start.o abort.o cpu_x86_64.o cpu_vectors_x86_64.o crt.o printf.o intr.o lib.o mem.o exit.o log.o cmdline.o tls.o mft.o hvt/platform.o hvt/platform_intr.o hvt/time.o hvt/platform_lifecycle.o hvt/yield.o hvt/tscclock.o hvt/console.o hvt/net.o hvt/block.o -o hvt/solo5_hvt.o
- ld: warning: cpu_vectors_x86_64.o: missing .note.GNU-stack section implies executable stack
- ld: NOTE: This behaviour is deprecated and will be removed in a future version of the linker
- OBJCOPY hvt/solo5_hvt.o
- objcopy -w -G solo5_\* -G _start\* -G __stack_chk_guard -G __stack_chk_fail hvt/solo5_hvt.o hvt/solo5_hvt.o
- make[1]: Leaving directory '/home/opam/.opam/4.14/.opam-switch/build/solo5-bindings-hvt.0.6.9/bindings'
- MAKE tenders
- /usr/bin/make -C tenders  
- make[1]: Entering directory '/home/opam/.opam/4.14/.opam-switch/build/solo5-bindings-hvt.0.6.9/tenders'
- HOSTCC common/elf.o
- cc -MT common/elf.o -MMD -MP -MF common/elf.Td -Wall -Werror -std=c11 -fstack-protector-strong -O2 -g -I/home/opam/.opam/4.14/.opam-switch/build/solo5-bindings-hvt.0.6.9/include/solo5 -c common/elf.c -o common/elf.o
- mv -f common/elf.Td common/elf.d && touch common/elf.o
- HOSTCC common/mft.o
- cc -MT common/mft.o -MMD -MP -MF common/mft.Td -Wall -Werror -std=c11 -fstack-protector-strong -O2 -g -I/home/opam/.opam/4.14/.opam-switch/build/solo5-bindings-hvt.0.6.9/include/solo5 -c common/mft.c -o common/mft.o
- mv -f common/mft.Td common/mft.d && touch common/mft.o
- HOSTCC common/block_attach.o
- cc -MT common/block_attach.o -MMD -MP -MF common/block_attach.Td -Wall -Werror -std=c11 -fstack-protector-strong -O2 -g -I/home/opam/.opam/4.14/.opam-switch/build/solo5-bindings-hvt.0.6.9/include/solo5 -c common/block_attach.c -o common/block_attach.o
- mv -f common/block_attach.Td common/block_attach.d && touch common/block_attach.o
- HOSTCC common/tap_attach.o
- cc -MT common/tap_attach.o -MMD -MP -MF common/tap_attach.Td -Wall -Werror -std=c11 -fstack-protector-strong -O2 -g -I/home/opam/.opam/4.14/.opam-switch/build/solo5-bindings-hvt.0.6.9/include/solo5 -c common/tap_attach.c -o common/tap_attach.o
- mv -f common/tap_attach.Td common/tap_attach.d && touch common/tap_attach.o
- HOSTAR common/libcommon.a
- ar rc common/libcommon.a common/elf.o common/mft.o common/block_attach.o common/tap_attach.o
- HOSTCC hvt/hvt_boot_info.o
- cc -MT hvt/hvt_boot_info.o -MMD -MP -MF hvt/hvt_boot_info.Td -Wall -Werror -std=c11 -fstack-protector-strong -O2 -g -I/home/opam/.opam/4.14/.opam-switch/build/solo5-bindings-hvt.0.6.9/include/solo5 -c hvt/hvt_boot_info.c -o hvt/hvt_boot_info.o
- mv -f hvt/hvt_boot_info.Td hvt/hvt_boot_info.d && touch hvt/hvt_boot_info.o
- HOSTCC hvt/hvt_core.o
- cc -MT hvt/hvt_core.o -MMD -MP -MF hvt/hvt_core.Td -Wall -Werror -std=c11 -fstack-protector-strong -O2 -g -I/home/opam/.opam/4.14/.opam-switch/build/solo5-bindings-hvt.0.6.9/include/solo5 -c hvt/hvt_core.c -o hvt/hvt_core.o
- mv -f hvt/hvt_core.Td hvt/hvt_core.d && touch hvt/hvt_core.o
- HOSTCC hvt/hvt_main.o
- cc -MT hvt/hvt_main.o -MMD -MP -MF hvt/hvt_main.Td -Wall -Werror -std=c11 -fstack-protector-strong -O2 -g -I/home/opam/.opam/4.14/.opam-switch/build/solo5-bindings-hvt.0.6.9/include/solo5 -c hvt/hvt_main.c -o hvt/hvt_main.o
- mv -f hvt/hvt_main.Td hvt/hvt_main.d && touch hvt/hvt_main.o
- HOSTCC hvt/hvt_cpu_x86_64.o
- cc -MT hvt/hvt_cpu_x86_64.o -MMD -MP -MF hvt/hvt_cpu_x86_64.Td -Wall -Werror -std=c11 -fstack-protector-strong -O2 -g -I/home/opam/.opam/4.14/.opam-switch/build/solo5-bindings-hvt.0.6.9/include/solo5 -c hvt/hvt_cpu_x86_64.c -o hvt/hvt_cpu_x86_64.o
- mv -f hvt/hvt_cpu_x86_64.Td hvt/hvt_cpu_x86_64.d && touch hvt/hvt_cpu_x86_64.o
- HOSTCC hvt/hvt_kvm.o
- cc -MT hvt/hvt_kvm.o -MMD -MP -MF hvt/hvt_kvm.Td -Wall -Werror -std=c11 -fstack-protector-strong -O2 -g -I/home/opam/.opam/4.14/.opam-switch/build/solo5-bindings-hvt.0.6.9/include/solo5 -c hvt/hvt_kvm.c -o hvt/hvt_kvm.o
- mv -f hvt/hvt_kvm.Td hvt/hvt_kvm.d && touch hvt/hvt_kvm.o
- HOSTCC hvt/hvt_kvm_x86_64.o
- cc -MT hvt/hvt_kvm_x86_64.o -MMD -MP -MF hvt/hvt_kvm_x86_64.Td -Wall -Werror -std=c11 -fstack-protector-strong -O2 -g -I/home/opam/.opam/4.14/.opam-switch/build/solo5-bindings-hvt.0.6.9/include/solo5 -c hvt/hvt_kvm_x86_64.c -o hvt/hvt_kvm_x86_64.o
- mv -f hvt/hvt_kvm_x86_64.Td hvt/hvt_kvm_x86_64.d && touch hvt/hvt_kvm_x86_64.o
- HOSTCC hvt/hvt_module_blk.o
- cc -MT hvt/hvt_module_blk.o -MMD -MP -MF hvt/hvt_module_blk.Td -Wall -Werror -std=c11 -fstack-protector-strong -O2 -g -I/home/opam/.opam/4.14/.opam-switch/build/solo5-bindings-hvt.0.6.9/include/solo5 -c hvt/hvt_module_blk.c -o hvt/hvt_module_blk.o
- mv -f hvt/hvt_module_blk.Td hvt/hvt_module_blk.d && touch hvt/hvt_module_blk.o
- HOSTCC hvt/hvt_module_net.o
- cc -MT hvt/hvt_module_net.o -MMD -MP -MF hvt/hvt_module_net.Td -Wall -Werror -std=c11 -fstack-protector-strong -O2 -g -I/home/opam/.opam/4.14/.opam-switch/build/solo5-bindings-hvt.0.6.9/include/solo5 -c hvt/hvt_module_net.c -o hvt/hvt_module_net.o
- mv -f hvt/hvt_module_net.Td hvt/hvt_module_net.d && touch hvt/hvt_module_net.o
- HOSTLINK hvt/solo5-hvt
- cc -Wl,-z -Wl,noexecstack hvt/hvt_boot_info.o hvt/hvt_core.o hvt/hvt_main.o hvt/hvt_cpu_x86_64.o hvt/hvt_kvm.o hvt/hvt_kvm_x86_64.o hvt/hvt_module_blk.o hvt/hvt_module_net.o common/libcommon.a  -o hvt/solo5-hvt
- HOSTCC hvt/hvt_module_gdb.o
- cc -MT hvt/hvt_module_gdb.o -MMD -MP -MF hvt/hvt_module_gdb.Td -Wall -Werror -std=c11 -fstack-protector-strong -O2 -g -I/home/opam/.opam/4.14/.opam-switch/build/solo5-bindings-hvt.0.6.9/include/solo5 -c hvt/hvt_module_gdb.c -o hvt/hvt_module_gdb.o
- mv -f hvt/hvt_module_gdb.Td hvt/hvt_module_gdb.d && touch hvt/hvt_module_gdb.o
- HOSTCC hvt/hvt_module_dumpcore.o
- cc -MT hvt/hvt_module_dumpcore.o -MMD -MP -MF hvt/hvt_module_dumpcore.Td -Wall -Werror -std=c11 -fstack-protector-strong -O2 -g -I/home/opam/.opam/4.14/.opam-switch/build/solo5-bindings-hvt.0.6.9/include/solo5 -c hvt/hvt_module_dumpcore.c -o hvt/hvt_module_dumpcore.o
- mv -f hvt/hvt_module_dumpcore.Td hvt/hvt_module_dumpcore.d && touch hvt/hvt_module_dumpcore.o
- HOSTLINK hvt/solo5-hvt-debug
- cc -Wl,-z -Wl,noexecstack hvt/hvt_boot_info.o hvt/hvt_core.o hvt/hvt_main.o hvt/hvt_cpu_x86_64.o hvt/hvt_kvm.o hvt/hvt_kvm_x86_64.o hvt/hvt_module_blk.o hvt/hvt_module_net.o hvt/hvt_module_gdb.o hvt/hvt_module_dumpcore.o common/libcommon.a  -o hvt/solo5-hvt-debug
- make[1]: Leaving directory '/home/opam/.opam/4.14/.opam-switch/build/solo5-bindings-hvt.0.6.9/tenders'
- MAKE elftool
- /usr/bin/make -C elftool  
- make[1]: Entering directory '/home/opam/.opam/4.14/.opam-switch/build/solo5-bindings-hvt.0.6.9/elftool'
- HOSTCC elftool.o
- cc -MT elftool.o -MMD -MP -MF elftool.Td -Wall -Werror -std=c11 -fstack-protector-strong -O2 -g -I/home/opam/.opam/4.14/.opam-switch/build/solo5-bindings-hvt.0.6.9/include/solo5 -c elftool.c -o elftool.o
- mv -f elftool.Td elftool.d && touch elftool.o
- HOSTLINK solo5-elftool
- cc  elftool.o  -o solo5-elftool
- make[1]: Leaving directory '/home/opam/.opam/4.14/.opam-switch/build/solo5-bindings-hvt.0.6.9/elftool'
- MAKE tests
- /usr/bin/make -C tests  
- make[1]: Entering directory '/home/opam/.opam/4.14/.opam-switch/build/solo5-bindings-hvt.0.6.9/tests'
- MAKE test_blk
- /usr/bin/make -C test_blk  
- make[2]: Entering directory '/home/opam/.opam/4.14/.opam-switch/build/solo5-bindings-hvt.0.6.9/tests/test_blk'
- CC test_blk.c
- cc -std=c11 -Wall -Wextra -Werror -O2 -g -ffreestanding -fstack-protector-strong -nostdinc -mstack-protector-guard=global -isystem /home/opam/.opam/4.14/.opam-switch/build/solo5-bindings-hvt.0.6.9/include/crt -I/home/opam/.opam/4.14/.opam-switch/build/solo5-bindings-hvt.0.6.9/include/solo5 -c test_blk.c -o test_blk.o
- ELFTOOL manifest.json
- /home/opam/.opam/4.14/.opam-switch/build/solo5-bindings-hvt.0.6.9/elftool/solo5-elftool gen-manifest manifest.json manifest.c
- CC manifest.c
- cc -std=c11 -Wall -Wextra -Werror -O2 -g -ffreestanding -fstack-protector-strong -nostdinc -mstack-protector-guard=global -isystem /home/opam/.opam/4.14/.opam-switch/build/solo5-bindings-hvt.0.6.9/include/crt -I/home/opam/.opam/4.14/.opam-switch/build/solo5-bindings-hvt.0.6.9/include/solo5 -c manifest.c -o manifest.o
- LD test_blk.hvt
- ld -nostdlib -z max-page-size=0x1000 -static  -T /home/opam/.opam/4.14/.opam-switch/build/solo5-bindings-hvt.0.6.9/bindings/hvt/solo5_hvt.lds /home/opam/.opam/4.14/.opam-switch/build/solo5-bindings-hvt.0.6.9/bindings/hvt/solo5_hvt.o test_blk.o manifest.o -o test_blk.hvt
- ld: warning: /home/opam/.opam/4.14/.opam-switch/build/solo5-bindings-hvt.0.6.9/bindings/hvt/solo5_hvt.o: requires executable stack (because the .note.GNU-stack section is executable)
- make[2]: Leaving directory '/home/opam/.opam/4.14/.opam-switch/build/solo5-bindings-hvt.0.6.9/tests/test_blk'
- MAKE test_dumpcore
- /usr/bin/make -C test_dumpcore  
- make[2]: Entering directory '/home/opam/.opam/4.14/.opam-switch/build/solo5-bindings-hvt.0.6.9/tests/test_dumpcore'
- CC test_dumpcore.c
- cc -std=c11 -Wall -Wextra -Werror -O2 -g -ffreestanding -fstack-protector-strong -nostdinc -mstack-protector-guard=global -isystem /home/opam/.opam/4.14/.opam-switch/build/solo5-bindings-hvt.0.6.9/include/crt -I/home/opam/.opam/4.14/.opam-switch/build/solo5-bindings-hvt.0.6.9/include/solo5 -c test_dumpcore.c -o test_dumpcore.o
- ELFTOOL manifest.json
- /home/opam/.opam/4.14/.opam-switch/build/solo5-bindings-hvt.0.6.9/elftool/solo5-elftool gen-manifest manifest.json manifest.c
- CC manifest.c
- cc -std=c11 -Wall -Wextra -Werror -O2 -g -ffreestanding -fstack-protector-strong -nostdinc -mstack-protector-guard=global -isystem /home/opam/.opam/4.14/.opam-switch/build/solo5-bindings-hvt.0.6.9/include/crt -I/home/opam/.opam/4.14/.opam-switch/build/solo5-bindings-hvt.0.6.9/include/solo5 -c manifest.c -o manifest.o
- LD test_dumpcore.hvt
- ld -nostdlib -z max-page-size=0x1000 -static  -T /home/opam/.opam/4.14/.opam-switch/build/solo5-bindings-hvt.0.6.9/bindings/hvt/solo5_hvt.lds /home/opam/.opam/4.14/.opam-switch/build/solo5-bindings-hvt.0.6.9/bindings/hvt/solo5_hvt.o test_dumpcore.o manifest.o -o test_dumpcore.hvt
- ld: warning: /home/opam/.opam/4.14/.opam-switch/build/solo5-bindings-hvt.0.6.9/bindings/hvt/solo5_hvt.o: requires executable stack (because the .note.GNU-stack section is executable)
- make[2]: Leaving directory '/home/opam/.opam/4.14/.opam-switch/build/solo5-bindings-hvt.0.6.9/tests/test_dumpcore'
- MAKE test_exception
- /usr/bin/make -C test_exception  
- make[2]: Entering directory '/home/opam/.opam/4.14/.opam-switch/build/solo5-bindings-hvt.0.6.9/tests/test_exception'
- CC test_exception.c
- cc -std=c11 -Wall -Wextra -Werror -O2 -g -ffreestanding -fstack-protector-strong -nostdinc -mstack-protector-guard=global -isystem /home/opam/.opam/4.14/.opam-switch/build/solo5-bindings-hvt.0.6.9/include/crt -I/home/opam/.opam/4.14/.opam-switch/build/solo5-bindings-hvt.0.6.9/include/solo5 -c test_exception.c -o test_exception.o
- ELFTOOL manifest.json
- /home/opam/.opam/4.14/.opam-switch/build/solo5-bindings-hvt.0.6.9/elftool/solo5-elftool gen-manifest manifest.json manifest.c
- CC manifest.c
- cc -std=c11 -Wall -Wextra -Werror -O2 -g -ffreestanding -fstack-protector-strong -nostdinc -mstack-protector-guard=global -isystem /home/opam/.opam/4.14/.opam-switch/build/solo5-bindings-hvt.0.6.9/include/crt -I/home/opam/.opam/4.14/.opam-switch/build/solo5-bindings-hvt.0.6.9/include/solo5 -c manifest.c -o manifest.o
- LD test_exception.hvt
- ld -nostdlib -z max-page-size=0x1000 -static  -T /home/opam/.opam/4.14/.opam-switch/build/solo5-bindings-hvt.0.6.9/bindings/hvt/solo5_hvt.lds /home/opam/.opam/4.14/.opam-switch/build/solo5-bindings-hvt.0.6.9/bindings/hvt/solo5_hvt.o test_exception.o manifest.o -o test_exception.hvt
- ld: warning: /home/opam/.opam/4.14/.opam-switch/build/solo5-bindings-hvt.0.6.9/bindings/hvt/solo5_hvt.o: requires executable stack (because the .note.GNU-stack section is executable)
- make[2]: Leaving directory '/home/opam/.opam/4.14/.opam-switch/build/solo5-bindings-hvt.0.6.9/tests/test_exception'
- MAKE test_fpu
- /usr/bin/make -C test_fpu  
- make[2]: Entering directory '/home/opam/.opam/4.14/.opam-switch/build/solo5-bindings-hvt.0.6.9/tests/test_fpu'
- CC test_fpu.c
- cc -std=c11 -Wall -Wextra -Werror -O2 -g -ffreestanding -fstack-protector-strong -nostdinc -mstack-protector-guard=global -isystem /home/opam/.opam/4.14/.opam-switch/build/solo5-bindings-hvt.0.6.9/include/crt -I/home/opam/.opam/4.14/.opam-switch/build/solo5-bindings-hvt.0.6.9/include/solo5 -c test_fpu.c -o test_fpu.o
- ELFTOOL manifest.json
- /home/opam/.opam/4.14/.opam-switch/build/solo5-bindings-hvt.0.6.9/elftool/solo5-elftool gen-manifest manifest.json manifest.c
- CC manifest.c
- cc -std=c11 -Wall -Wextra -Werror -O2 -g -ffreestanding -fstack-protector-strong -nostdinc -mstack-protector-guard=global -isystem /home/opam/.opam/4.14/.opam-switch/build/solo5-bindings-hvt.0.6.9/include/crt -I/home/opam/.opam/4.14/.opam-switch/build/solo5-bindings-hvt.0.6.9/include/solo5 -c manifest.c -o manifest.o
- LD test_fpu.hvt
- ld -nostdlib -z max-page-size=0x1000 -static  -T /home/opam/.opam/4.14/.opam-switch/build/solo5-bindings-hvt.0.6.9/bindings/hvt/solo5_hvt.lds /home/opam/.opam/4.14/.opam-switch/build/solo5-bindings-hvt.0.6.9/bindings/hvt/solo5_hvt.o test_fpu.o manifest.o -o test_fpu.hvt
- ld: warning: /home/opam/.opam/4.14/.opam-switch/build/solo5-bindings-hvt.0.6.9/bindings/hvt/solo5_hvt.o: requires executable stack (because the .note.GNU-stack section is executable)
- make[2]: Leaving directory '/home/opam/.opam/4.14/.opam-switch/build/solo5-bindings-hvt.0.6.9/tests/test_fpu'
- MAKE test_globals
- /usr/bin/make -C test_globals  
- make[2]: Entering directory '/home/opam/.opam/4.14/.opam-switch/build/solo5-bindings-hvt.0.6.9/tests/test_globals'
- CC test_globals.c
- cc -std=c11 -Wall -Wextra -Werror -O2 -g -ffreestanding -fstack-protector-strong -nostdinc -mstack-protector-guard=global -isystem /home/opam/.opam/4.14/.opam-switch/build/solo5-bindings-hvt.0.6.9/include/crt -I/home/opam/.opam/4.14/.opam-switch/build/solo5-bindings-hvt.0.6.9/include/solo5 -c test_globals.c -o test_globals.o
- ELFTOOL manifest.json
- /home/opam/.opam/4.14/.opam-switch/build/solo5-bindings-hvt.0.6.9/elftool/solo5-elftool gen-manifest manifest.json manifest.c
- CC manifest.c
- cc -std=c11 -Wall -Wextra -Werror -O2 -g -ffreestanding -fstack-protector-strong -nostdinc -mstack-protector-guard=global -isystem /home/opam/.opam/4.14/.opam-switch/build/solo5-bindings-hvt.0.6.9/include/crt -I/home/opam/.opam/4.14/.opam-switch/build/solo5-bindings-hvt.0.6.9/include/solo5 -c manifest.c -o manifest.o
- LD test_globals.hvt
- ld -nostdlib -z max-page-size=0x1000 -static  -T /home/opam/.opam/4.14/.opam-switch/build/solo5-bindings-hvt.0.6.9/bindings/hvt/solo5_hvt.lds /home/opam/.opam/4.14/.opam-switch/build/solo5-bindings-hvt.0.6.9/bindings/hvt/solo5_hvt.o test_globals.o manifest.o -o test_globals.hvt
- ld: warning: /home/opam/.opam/4.14/.opam-switch/build/solo5-bindings-hvt.0.6.9/bindings/hvt/solo5_hvt.o: requires executable stack (because the .note.GNU-stack section is executable)
- make[2]: Leaving directory '/home/opam/.opam/4.14/.opam-switch/build/solo5-bindings-hvt.0.6.9/tests/test_globals'
- MAKE test_hello
- /usr/bin/make -C test_hello  
- make[2]: Entering directory '/home/opam/.opam/4.14/.opam-switch/build/solo5-bindings-hvt.0.6.9/tests/test_hello'
- CC test_hello.c
- cc -std=c11 -Wall -Wextra -Werror -O2 -g -ffreestanding -fstack-protector-strong -nostdinc -mstack-protector-guard=global -isystem /home/opam/.opam/4.14/.opam-switch/build/solo5-bindings-hvt.0.6.9/include/crt -I/home/opam/.opam/4.14/.opam-switch/build/solo5-bindings-hvt.0.6.9/include/solo5 -c test_hello.c -o test_hello.o
- ELFTOOL manifest.json
- /home/opam/.opam/4.14/.opam-switch/build/solo5-bindings-hvt.0.6.9/elftool/solo5-elftool gen-manifest manifest.json manifest.c
- CC manifest.c
- cc -std=c11 -Wall -Wextra -Werror -O2 -g -ffreestanding -fstack-protector-strong -nostdinc -mstack-protector-guard=global -isystem /home/opam/.opam/4.14/.opam-switch/build/solo5-bindings-hvt.0.6.9/include/crt -I/home/opam/.opam/4.14/.opam-switch/build/solo5-bindings-hvt.0.6.9/include/solo5 -c manifest.c -o manifest.o
- LD test_hello.hvt
- ld -nostdlib -z max-page-size=0x1000 -static  -T /home/opam/.opam/4.14/.opam-switch/build/solo5-bindings-hvt.0.6.9/bindings/hvt/solo5_hvt.lds /home/opam/.opam/4.14/.opam-switch/build/solo5-bindings-hvt.0.6.9/bindings/hvt/solo5_hvt.o test_hello.o manifest.o -o test_hello.hvt
- ld: warning: /home/opam/.opam/4.14/.opam-switch/build/solo5-bindings-hvt.0.6.9/bindings/hvt/solo5_hvt.o: requires executable stack (because the .note.GNU-stack section is executable)
- make[2]: Leaving directory '/home/opam/.opam/4.14/.opam-switch/build/solo5-bindings-hvt.0.6.9/tests/test_hello'
- MAKE test_mft_maxdevices
- /usr/bin/make -C test_mft_maxdevices  
- make[2]: Entering directory '/home/opam/.opam/4.14/.opam-switch/build/solo5-bindings-hvt.0.6.9/tests/test_mft_maxdevices'
- CC test_mft_maxdevices.c
- cc -std=c11 -Wall -Wextra -Werror -O2 -g -ffreestanding -fstack-protector-strong -nostdinc -mstack-protector-guard=global -isystem /home/opam/.opam/4.14/.opam-switch/build/solo5-bindings-hvt.0.6.9/include/crt -I/home/opam/.opam/4.14/.opam-switch/build/solo5-bindings-hvt.0.6.9/include/solo5 -c test_mft_maxdevices.c -o test_mft_maxdevices.o
- ELFTOOL manifest.json
- /home/opam/.opam/4.14/.opam-switch/build/solo5-bindings-hvt.0.6.9/elftool/solo5-elftool gen-manifest manifest.json manifest.c
- CC manifest.c
- cc -std=c11 -Wall -Wextra -Werror -O2 -g -ffreestanding -fstack-protector-strong -nostdinc -mstack-protector-guard=global -isystem /home/opam/.opam/4.14/.opam-switch/build/solo5-bindings-hvt.0.6.9/include/crt -I/home/opam/.opam/4.14/.opam-switch/build/solo5-bindings-hvt.0.6.9/include/solo5 -c manifest.c -o manifest.o
- LD test_mft_maxdevices.hvt
- ld -nostdlib -z max-page-size=0x1000 -static  -T /home/opam/.opam/4.14/.opam-switch/build/solo5-bindings-hvt.0.6.9/bindings/hvt/solo5_hvt.lds /home/opam/.opam/4.14/.opam-switch/build/solo5-bindings-hvt.0.6.9/bindings/hvt/solo5_hvt.o test_mft_maxdevices.o manifest.o -o test_mft_maxdevices.hvt
- ld: warning: /home/opam/.opam/4.14/.opam-switch/build/solo5-bindings-hvt.0.6.9/bindings/hvt/solo5_hvt.o: requires executable stack (because the .note.GNU-stack section is executable)
- make[2]: Leaving directory '/home/opam/.opam/4.14/.opam-switch/build/solo5-bindings-hvt.0.6.9/tests/test_mft_maxdevices'
- MAKE test_net
- /usr/bin/make -C test_net  
- make[2]: Entering directory '/home/opam/.opam/4.14/.opam-switch/build/solo5-bindings-hvt.0.6.9/tests/test_net'
- CC test_net.c
- cc -std=c11 -Wall -Wextra -Werror -O2 -g -ffreestanding -fstack-protector-strong -nostdinc -mstack-protector-guard=global -isystem /home/opam/.opam/4.14/.opam-switch/build/solo5-bindings-hvt.0.6.9/include/crt -I/home/opam/.opam/4.14/.opam-switch/build/solo5-bindings-hvt.0.6.9/include/solo5 -c test_net.c -o test_net.o
- ELFTOOL manifest.json
- /home/opam/.opam/4.14/.opam-switch/build/solo5-bindings-hvt.0.6.9/elftool/solo5-elftool gen-manifest manifest.json manifest.c
- CC manifest.c
- cc -std=c11 -Wall -Wextra -Werror -O2 -g -ffreestanding -fstack-protector-strong -nostdinc -mstack-protector-guard=global -isystem /home/opam/.opam/4.14/.opam-switch/build/solo5-bindings-hvt.0.6.9/include/crt -I/home/opam/.opam/4.14/.opam-switch/build/solo5-bindings-hvt.0.6.9/include/solo5 -c manifest.c -o manifest.o
- LD test_net.hvt
- ld -nostdlib -z max-page-size=0x1000 -static  -T /home/opam/.opam/4.14/.opam-switch/build/solo5-bindings-hvt.0.6.9/bindings/hvt/solo5_hvt.lds /home/opam/.opam/4.14/.opam-switch/build/solo5-bindings-hvt.0.6.9/bindings/hvt/solo5_hvt.o test_net.o manifest.o -o test_net.hvt
- ld: warning: /home/opam/.opam/4.14/.opam-switch/build/solo5-bindings-hvt.0.6.9/bindings/hvt/solo5_hvt.o: requires executable stack (because the .note.GNU-stack section is executable)
- make[2]: Leaving directory '/home/opam/.opam/4.14/.opam-switch/build/solo5-bindings-hvt.0.6.9/tests/test_net'
- MAKE test_net_2if
- /usr/bin/make -C test_net_2if  
- make[2]: Entering directory '/home/opam/.opam/4.14/.opam-switch/build/solo5-bindings-hvt.0.6.9/tests/test_net_2if'
- CC test_net_2if.c
- cc -std=c11 -Wall -Wextra -Werror -O2 -g -ffreestanding -fstack-protector-strong -nostdinc -mstack-protector-guard=global -isystem /home/opam/.opam/4.14/.opam-switch/build/solo5-bindings-hvt.0.6.9/include/crt -I/home/opam/.opam/4.14/.opam-switch/build/solo5-bindings-hvt.0.6.9/include/solo5 -c test_net_2if.c -o test_net_2if.o
- ELFTOOL manifest.json
- /home/opam/.opam/4.14/.opam-switch/build/solo5-bindings-hvt.0.6.9/elftool/solo5-elftool gen-manifest manifest.json manifest.c
- CC manifest.c
- cc -std=c11 -Wall -Wextra -Werror -O2 -g -ffreestanding -fstack-protector-strong -nostdinc -mstack-protector-guard=global -isystem /home/opam/.opam/4.14/.opam-switch/build/solo5-bindings-hvt.0.6.9/include/crt -I/home/opam/.opam/4.14/.opam-switch/build/solo5-bindings-hvt.0.6.9/include/solo5 -c manifest.c -o manifest.o
- LD test_net_2if.hvt
- ld -nostdlib -z max-page-size=0x1000 -static  -T /home/opam/.opam/4.14/.opam-switch/build/solo5-bindings-hvt.0.6.9/bindings/hvt/solo5_hvt.lds /home/opam/.opam/4.14/.opam-switch/build/solo5-bindings-hvt.0.6.9/bindings/hvt/solo5_hvt.o test_net_2if.o manifest.o -o test_net_2if.hvt
- ld: warning: /home/opam/.opam/4.14/.opam-switch/build/solo5-bindings-hvt.0.6.9/bindings/hvt/solo5_hvt.o: requires executable stack (because the .note.GNU-stack section is executable)
- make[2]: Leaving directory '/home/opam/.opam/4.14/.opam-switch/build/solo5-bindings-hvt.0.6.9/tests/test_net_2if'
- MAKE test_notls
- /usr/bin/make -C test_notls  
- make[2]: Entering directory '/home/opam/.opam/4.14/.opam-switch/build/solo5-bindings-hvt.0.6.9/tests/test_notls'
- CC test_notls.c
- cc -std=c11 -Wall -Wextra -Werror -O2 -g -ffreestanding -fstack-protector-strong -nostdinc -mstack-protector-guard=global -isystem /home/opam/.opam/4.14/.opam-switch/build/solo5-bindings-hvt.0.6.9/include/crt -I/home/opam/.opam/4.14/.opam-switch/build/solo5-bindings-hvt.0.6.9/include/solo5 -c test_notls.c -o test_notls.o
- ELFTOOL manifest.json
- /home/opam/.opam/4.14/.opam-switch/build/solo5-bindings-hvt.0.6.9/elftool/solo5-elftool gen-manifest manifest.json manifest.c
- CC manifest.c
- cc -std=c11 -Wall -Wextra -Werror -O2 -g -ffreestanding -fstack-protector-strong -nostdinc -mstack-protector-guard=global -isystem /home/opam/.opam/4.14/.opam-switch/build/solo5-bindings-hvt.0.6.9/include/crt -I/home/opam/.opam/4.14/.opam-switch/build/solo5-bindings-hvt.0.6.9/include/solo5 -c manifest.c -o manifest.o
- LD test_notls.hvt
- ld -nostdlib -z max-page-size=0x1000 -static  -T /home/opam/.opam/4.14/.opam-switch/build/solo5-bindings-hvt.0.6.9/bindings/hvt/solo5_hvt.lds /home/opam/.opam/4.14/.opam-switch/build/solo5-bindings-hvt.0.6.9/bindings/hvt/solo5_hvt.o test_notls.o manifest.o -o test_notls.hvt
- ld: warning: /home/opam/.opam/4.14/.opam-switch/build/solo5-bindings-hvt.0.6.9/bindings/hvt/solo5_hvt.o: requires executable stack (because the .note.GNU-stack section is executable)
- make[2]: Leaving directory '/home/opam/.opam/4.14/.opam-switch/build/solo5-bindings-hvt.0.6.9/tests/test_notls'
- MAKE test_quiet
- /usr/bin/make -C test_quiet  
- make[2]: Entering directory '/home/opam/.opam/4.14/.opam-switch/build/solo5-bindings-hvt.0.6.9/tests/test_quiet'
- CC test_quiet.c
- cc -std=c11 -Wall -Wextra -Werror -O2 -g -ffreestanding -fstack-protector-strong -nostdinc -mstack-protector-guard=global -isystem /home/opam/.opam/4.14/.opam-switch/build/solo5-bindings-hvt.0.6.9/include/crt -I/home/opam/.opam/4.14/.opam-switch/build/solo5-bindings-hvt.0.6.9/include/solo5 -c test_quiet.c -o test_quiet.o
- ELFTOOL manifest.json
- /home/opam/.opam/4.14/.opam-switch/build/solo5-bindings-hvt.0.6.9/elftool/solo5-elftool gen-manifest manifest.json manifest.c
- CC manifest.c
- cc -std=c11 -Wall -Wextra -Werror -O2 -g -ffreestanding -fstack-protector-strong -nostdinc -mstack-protector-guard=global -isystem /home/opam/.opam/4.14/.opam-switch/build/solo5-bindings-hvt.0.6.9/include/crt -I/home/opam/.opam/4.14/.opam-switch/build/solo5-bindings-hvt.0.6.9/include/solo5 -c manifest.c -o manifest.o
- LD test_quiet.hvt
- ld -nostdlib -z max-page-size=0x1000 -static  -T /home/opam/.opam/4.14/.opam-switch/build/solo5-bindings-hvt.0.6.9/bindings/hvt/solo5_hvt.lds /home/opam/.opam/4.14/.opam-switch/build/solo5-bindings-hvt.0.6.9/bindings/hvt/solo5_hvt.o test_quiet.o manifest.o -o test_quiet.hvt
- ld: warning: /home/opam/.opam/4.14/.opam-switch/build/solo5-bindings-hvt.0.6.9/bindings/hvt/solo5_hvt.o: requires executable stack (because the .note.GNU-stack section is executable)
- make[2]: Leaving directory '/home/opam/.opam/4.14/.opam-switch/build/solo5-bindings-hvt.0.6.9/tests/test_quiet'
- MAKE test_seccomp
- /usr/bin/make -C test_seccomp  
- make[2]: Entering directory '/home/opam/.opam/4.14/.opam-switch/build/solo5-bindings-hvt.0.6.9/tests/test_seccomp'
- make[2]: Nothing to be done for 'all'.
- make[2]: Leaving directory '/home/opam/.opam/4.14/.opam-switch/build/solo5-bindings-hvt.0.6.9/tests/test_seccomp'
- MAKE test_ssp
- /usr/bin/make -C test_ssp  
- make[2]: Entering directory '/home/opam/.opam/4.14/.opam-switch/build/solo5-bindings-hvt.0.6.9/tests/test_ssp'
- CC test_ssp.c
- cc -std=c11 -Wall -Wextra -Werror -O2 -g -ffreestanding -fstack-protector-strong -nostdinc -mstack-protector-guard=global -isystem /home/opam/.opam/4.14/.opam-switch/build/solo5-bindings-hvt.0.6.9/include/crt -I/home/opam/.opam/4.14/.opam-switch/build/solo5-bindings-hvt.0.6.9/include/solo5 -c test_ssp.c -o test_ssp.o
- ELFTOOL manifest.json
- /home/opam/.opam/4.14/.opam-switch/build/solo5-bindings-hvt.0.6.9/elftool/solo5-elftool gen-manifest manifest.json manifest.c
- CC manifest.c
- cc -std=c11 -Wall -Wextra -Werror -O2 -g -ffreestanding -fstack-protector-strong -nostdinc -mstack-protector-guard=global -isystem /home/opam/.opam/4.14/.opam-switch/build/solo5-bindings-hvt.0.6.9/include/crt -I/home/opam/.opam/4.14/.opam-switch/build/solo5-bindings-hvt.0.6.9/include/solo5 -c manifest.c -o manifest.o
- LD test_ssp.hvt
- ld -nostdlib -z max-page-size=0x1000 -static  -T /home/opam/.opam/4.14/.opam-switch/build/solo5-bindings-hvt.0.6.9/bindings/hvt/solo5_hvt.lds /home/opam/.opam/4.14/.opam-switch/build/solo5-bindings-hvt.0.6.9/bindings/hvt/solo5_hvt.o test_ssp.o manifest.o -o test_ssp.hvt
- ld: warning: /home/opam/.opam/4.14/.opam-switch/build/solo5-bindings-hvt.0.6.9/bindings/hvt/solo5_hvt.o: requires executable stack (because the .note.GNU-stack section is executable)
- make[2]: Leaving directory '/home/opam/.opam/4.14/.opam-switch/build/solo5-bindings-hvt.0.6.9/tests/test_ssp'
- MAKE test_time
- /usr/bin/make -C test_time  
- make[2]: Entering directory '/home/opam/.opam/4.14/.opam-switch/build/solo5-bindings-hvt.0.6.9/tests/test_time'
- CC test_time.c
- cc -std=c11 -Wall -Wextra -Werror -O2 -g -ffreestanding -fstack-protector-strong -nostdinc -mstack-protector-guard=global -isystem /home/opam/.opam/4.14/.opam-switch/build/solo5-bindings-hvt.0.6.9/include/crt -I/home/opam/.opam/4.14/.opam-switch/build/solo5-bindings-hvt.0.6.9/include/solo5 -c test_time.c -o test_time.o
- ELFTOOL manifest.json
- /home/opam/.opam/4.14/.opam-switch/build/solo5-bindings-hvt.0.6.9/elftool/solo5-elftool gen-manifest manifest.json manifest.c
- CC manifest.c
- cc -std=c11 -Wall -Wextra -Werror -O2 -g -ffreestanding -fstack-protector-strong -nostdinc -mstack-protector-guard=global -isystem /home/opam/.opam/4.14/.opam-switch/build/solo5-bindings-hvt.0.6.9/include/crt -I/home/opam/.opam/4.14/.opam-switch/build/solo5-bindings-hvt.0.6.9/include/solo5 -c manifest.c -o manifest.o
- LD test_time.hvt
- ld -nostdlib -z max-page-size=0x1000 -static  -T /home/opam/.opam/4.14/.opam-switch/build/solo5-bindings-hvt.0.6.9/bindings/hvt/solo5_hvt.lds /home/opam/.opam/4.14/.opam-switch/build/solo5-bindings-hvt.0.6.9/bindings/hvt/solo5_hvt.o test_time.o manifest.o -o test_time.hvt
- ld: warning: /home/opam/.opam/4.14/.opam-switch/build/solo5-bindings-hvt.0.6.9/bindings/hvt/solo5_hvt.o: requires executable stack (because the .note.GNU-stack section is executable)
- make[2]: Leaving directory '/home/opam/.opam/4.14/.opam-switch/build/solo5-bindings-hvt.0.6.9/tests/test_time'
- MAKE test_tls
- /usr/bin/make -C test_tls  
- make[2]: Entering directory '/home/opam/.opam/4.14/.opam-switch/build/solo5-bindings-hvt.0.6.9/tests/test_tls'
- CC test_tls.c
- cc -std=c11 -Wall -Wextra -Werror -O2 -g -ffreestanding -fstack-protector-strong -nostdinc -mstack-protector-guard=global -isystem /home/opam/.opam/4.14/.opam-switch/build/solo5-bindings-hvt.0.6.9/include/crt -I/home/opam/.opam/4.14/.opam-switch/build/solo5-bindings-hvt.0.6.9/include/solo5 -c test_tls.c -o test_tls.o
- ELFTOOL manifest.json
- /home/opam/.opam/4.14/.opam-switch/build/solo5-bindings-hvt.0.6.9/elftool/solo5-elftool gen-manifest manifest.json manifest.c
- CC manifest.c
- cc -std=c11 -Wall -Wextra -Werror -O2 -g -ffreestanding -fstack-protector-strong -nostdinc -mstack-protector-guard=global -isystem /home/opam/.opam/4.14/.opam-switch/build/solo5-bindings-hvt.0.6.9/include/crt -I/home/opam/.opam/4.14/.opam-switch/build/solo5-bindings-hvt.0.6.9/include/solo5 -c manifest.c -o manifest.o
- LD test_tls.hvt
- ld -nostdlib -z max-page-size=0x1000 -static  -T /home/opam/.opam/4.14/.opam-switch/build/solo5-bindings-hvt.0.6.9/bindings/hvt/solo5_hvt.lds /home/opam/.opam/4.14/.opam-switch/build/solo5-bindings-hvt.0.6.9/bindings/hvt/solo5_hvt.o test_tls.o manifest.o -o test_tls.hvt
- ld: warning: /home/opam/.opam/4.14/.opam-switch/build/solo5-bindings-hvt.0.6.9/bindings/hvt/solo5_hvt.o: requires executable stack (because the .note.GNU-stack section is executable)
- make[2]: Leaving directory '/home/opam/.opam/4.14/.opam-switch/build/solo5-bindings-hvt.0.6.9/tests/test_tls'
- MAKE test_wnox
- /usr/bin/make -C test_wnox  
- make[2]: Entering directory '/home/opam/.opam/4.14/.opam-switch/build/solo5-bindings-hvt.0.6.9/tests/test_wnox'
- CC test_wnox.c
- cc -std=c11 -Wall -Wextra -Werror -O2 -g -ffreestanding -fstack-protector-strong -nostdinc -mstack-protector-guard=global -isystem /home/opam/.opam/4.14/.opam-switch/build/solo5-bindings-hvt.0.6.9/include/crt -I/home/opam/.opam/4.14/.opam-switch/build/solo5-bindings-hvt.0.6.9/include/solo5 -c test_wnox.c -o test_wnox.o
- /tmp/ccNWt9pv.s: Assembler messages:
- /tmp/ccNWt9pv.s:726: Warning: ignoring changed section attributes for .data
- /tmp/ccNWt9pv.s:733: Warning: dwarf line number information for .data ignored
- /tmp/ccNWt9pv.s:735: Warning: dwarf line number information for .data ignored
- /tmp/ccNWt9pv.s:736: Warning: dwarf line number information for .data ignored
- ELFTOOL manifest.json
- /home/opam/.opam/4.14/.opam-switch/build/solo5-bindings-hvt.0.6.9/elftool/solo5-elftool gen-manifest manifest.json manifest.c
- CC manifest.c
- cc -std=c11 -Wall -Wextra -Werror -O2 -g -ffreestanding -fstack-protector-strong -nostdinc -mstack-protector-guard=global -isystem /home/opam/.opam/4.14/.opam-switch/build/solo5-bindings-hvt.0.6.9/include/crt -I/home/opam/.opam/4.14/.opam-switch/build/solo5-bindings-hvt.0.6.9/include/solo5 -c manifest.c -o manifest.o
- LD test_wnox.hvt
- ld -nostdlib -z max-page-size=0x1000 -static  -T /home/opam/.opam/4.14/.opam-switch/build/solo5-bindings-hvt.0.6.9/bindings/hvt/solo5_hvt.lds /home/opam/.opam/4.14/.opam-switch/build/solo5-bindings-hvt.0.6.9/bindings/hvt/solo5_hvt.o test_wnox.o manifest.o -o test_wnox.hvt
- ld: warning: /home/opam/.opam/4.14/.opam-switch/build/solo5-bindings-hvt.0.6.9/bindings/hvt/solo5_hvt.o: requires executable stack (because the .note.GNU-stack section is executable)
- make[2]: Leaving directory '/home/opam/.opam/4.14/.opam-switch/build/solo5-bindings-hvt.0.6.9/tests/test_wnox'
- MAKE test_xnow
- /usr/bin/make -C test_xnow  
- make[2]: Entering directory '/home/opam/.opam/4.14/.opam-switch/build/solo5-bindings-hvt.0.6.9/tests/test_xnow'
- CC test_xnow.c
- cc -std=c11 -Wall -Wextra -Werror -O2 -g -ffreestanding -fstack-protector-strong -nostdinc -mstack-protector-guard=global -isystem /home/opam/.opam/4.14/.opam-switch/build/solo5-bindings-hvt.0.6.9/include/crt -I/home/opam/.opam/4.14/.opam-switch/build/solo5-bindings-hvt.0.6.9/include/solo5 -c test_xnow.c -o test_xnow.o
- ELFTOOL manifest.json
- /home/opam/.opam/4.14/.opam-switch/build/solo5-bindings-hvt.0.6.9/elftool/solo5-elftool gen-manifest manifest.json manifest.c
- CC manifest.c
- cc -std=c11 -Wall -Wextra -Werror -O2 -g -ffreestanding -fstack-protector-strong -nostdinc -mstack-protector-guard=global -isystem /home/opam/.opam/4.14/.opam-switch/build/solo5-bindings-hvt.0.6.9/include/crt -I/home/opam/.opam/4.14/.opam-switch/build/solo5-bindings-hvt.0.6.9/include/solo5 -c manifest.c -o manifest.o
- LD test_xnow.hvt
- ld -nostdlib -z max-page-size=0x1000 -static  -T /home/opam/.opam/4.14/.opam-switch/build/solo5-bindings-hvt.0.6.9/bindings/hvt/solo5_hvt.lds /home/opam/.opam/4.14/.opam-switch/build/solo5-bindings-hvt.0.6.9/bindings/hvt/solo5_hvt.o test_xnow.o manifest.o -o test_xnow.hvt
- ld: warning: /home/opam/.opam/4.14/.opam-switch/build/solo5-bindings-hvt.0.6.9/bindings/hvt/solo5_hvt.o: requires executable stack (because the .note.GNU-stack section is executable)
- make[2]: Leaving directory '/home/opam/.opam/4.14/.opam-switch/build/solo5-bindings-hvt.0.6.9/tests/test_xnow'
- MAKE test_zeropage
- /usr/bin/make -C test_zeropage  
- make[2]: Entering directory '/home/opam/.opam/4.14/.opam-switch/build/solo5-bindings-hvt.0.6.9/tests/test_zeropage'
- CC test_zeropage.c
- cc -std=c11 -Wall -Wextra -Werror -O2 -g -ffreestanding -fstack-protector-strong -nostdinc -mstack-protector-guard=global -isystem /home/opam/.opam/4.14/.opam-switch/build/solo5-bindings-hvt.0.6.9/include/crt -I/home/opam/.opam/4.14/.opam-switch/build/solo5-bindings-hvt.0.6.9/include/solo5 -c test_zeropage.c -o test_zeropage.o
- test_zeropage.c: In function 'solo5_app_main':
- test_zeropage.c:39:5: error: array subscript 0 is outside array bounds of 'uint64_t[0]' {aka 'long unsigned int[]'} [-Werror=array-bounds]
-    39 |     *addr_invalid = 1;
-       |     ^~~~~~~~~~~~~
- cc1: all warnings being treated as errors
- make[2]: *** [../Makefile.tests:51: test_zeropage.o] Error 1
- make[2]: Leaving directory '/home/opam/.opam/4.14/.opam-switch/build/solo5-bindings-hvt.0.6.9/tests/test_zeropage'
- make[1]: *** [GNUmakefile:33: test_zeropage] Error 2
- make[1]: Leaving directory '/home/opam/.opam/4.14/.opam-switch/build/solo5-bindings-hvt.0.6.9/tests'
- make: *** [GNUmakefile:70: tests] Error 2
[ERROR] The compilation of solo5-bindings-hvt.0.6.9 failed at "make V=1 CONFIG_SPT= CONFIG_VIRTIO= CONFIG_MUEN= CONFIG_GENODE= CONFIG_XEN=".
Processing 62/78: [topkg: ocaml build]
Processing 63/78: [topkg: ocaml build]
Processing 64/78: [topkg: ocaml build]
Processing 65/78: [topkg: ocaml build]
+ /home/opam/.opam/4.14/bin/ocaml "pkg/pkg.ml" "build" "--pkg-name" "topkg" "--dev-pkg" "false" (CWD=/home/opam/.opam/4.14/.opam-switch/build/topkg.1.0.7)
- ocamlfind ocamldep -modules src/topkg.ml > src/topkg.ml.depends
- ocamlfind ocamldep -modules src/topkg.mli > src/topkg.mli.depends
- ocamlfind ocamlc -c -g -bin-annot -safe-string -I src -I test -I src-care -I src-bin -o src/topkg.cmi src/topkg.mli
- ocamlfind ocamldep -modules src/topkg_build.ml > src/topkg_build.ml.depends
- ocamlfind ocamldep -modules src/topkg_build.mli > src/topkg_build.mli.depends
- ocamlfind ocamldep -modules src/topkg_cmd.mli > src/topkg_cmd.mli.depends
- ocamlfind ocamldep -modules src/topkg_fpath.mli > src/topkg_fpath.mli.depends
- ocamlfind ocamlc -c -g -bin-annot -safe-string -I src -I test -I src-care -I src-bin -o src/topkg_fpath.cmi src/topkg_fpath.mli
- ocamlfind ocamldep -modules src/topkg_codec.mli > src/topkg_codec.mli.depends
- ocamlfind ocamlc -c -g -bin-annot -safe-string -I src -I test -I src-care -I src-bin -o src/topkg_cmd.cmi src/topkg_cmd.mli
- ocamlfind ocamldep -modules src/topkg_result.mli > src/topkg_result.mli.depends
- ocamlfind ocamlc -c -g -bin-annot -safe-string -I src -I test -I src-care -I src-bin -o src/topkg_result.cmi src/topkg_result.mli
- ocamlfind ocamldep -modules src/topkg_conf.mli > src/topkg_conf.mli.depends
- ocamlfind ocamlc -c -g -bin-annot -safe-string -I src -I test -I src-care -I src-bin -o src/topkg_codec.cmi src/topkg_codec.mli
- ocamlfind ocamlc -c -g -bin-annot -safe-string -I src -I test -I src-care -I src-bin -o src/topkg_conf.cmi src/topkg_conf.mli
- ocamlfind ocamlc -c -g -bin-annot -safe-string -I src -I test -I src-care -I src-bin -o src/topkg_build.cmi src/topkg_build.mli
- ocamlfind ocamldep -modules src/topkg_cmd.ml > src/topkg_cmd.ml.depends
- ocamlfind ocamldep -modules src/topkg_fpath.ml > src/topkg_fpath.ml.depends
- ocamlfind ocamldep -modules src/topkg_string.ml > src/topkg_string.ml.depends
- ocamlfind ocamldep -modules src/topkg_string.mli > src/topkg_string.mli.depends
- ocamlfind ocamlc -c -g -bin-annot -safe-string -I src -I test -I src-care -I src-bin -o src/topkg_string.cmi src/topkg_string.mli
- ocamlfind ocamlopt -c -g -bin-annot -safe-string -I src -I test -I src-care -I src-bin -o src/topkg_string.cmx src/topkg_string.ml
- ocamlfind ocamlopt -c -g -bin-annot -safe-string -I src -I test -I src-care -I src-bin -o src/topkg_fpath.cmx src/topkg_fpath.ml
- ocamlfind ocamldep -modules src/topkg_codec.ml > src/topkg_codec.ml.depends
- ocamlfind ocamlopt -c -g -bin-annot -safe-string -I src -I test -I src-care -I src-bin -o src/topkg_cmd.cmx src/topkg_cmd.ml
- ocamlfind ocamldep -modules src/topkg_os.ml > src/topkg_os.ml.depends
- ocamlfind ocamldep -modules src/topkg_os.mli > src/topkg_os.mli.depends
- ocamlfind ocamlc -c -g -bin-annot -safe-string -I src -I test -I src-care -I src-bin -o src/topkg_os.cmi src/topkg_os.mli
- ocamlfind ocamldep -modules src/topkg_log.ml > src/topkg_log.ml.depends
- ocamlfind ocamldep -modules src/topkg_log.mli > src/topkg_log.mli.depends
- ocamlfind ocamlc -c -g -bin-annot -safe-string -I src -I test -I src-care -I src-bin -o src/topkg_log.cmi src/topkg_log.mli
- ocamlfind ocamldep -modules src/topkg_result.ml > src/topkg_result.ml.depends
- ocamlfind ocamlopt -c -g -bin-annot -safe-string -I src -I test -I src-care -I src-bin -o src/topkg_result.cmx src/topkg_result.ml
- ocamlfind ocamlopt -c -g -bin-annot -safe-string -I src -I test -I src-care -I src-bin -o src/topkg_log.cmx src/topkg_log.ml
- ocamlfind ocamlopt -c -g -bin-annot -safe-string -I src -I test -I src-care -I src-bin -o src/topkg_os.cmx src/topkg_os.ml
- ocamlfind ocamldep -modules src/topkg_conf.ml > src/topkg_conf.ml.depends
- ocamlfind ocamlopt -c -g -bin-annot -safe-string -I src -I test -I src-care -I src-bin -o src/topkg_codec.cmx src/topkg_codec.ml
- ocamlfind ocamldep -modules src/topkg_vcs.ml > src/topkg_vcs.ml.depends
- ocamlfind ocamldep -modules src/topkg_vcs.mli > src/topkg_vcs.mli.depends
- ocamlfind ocamlc -c -g -bin-annot -safe-string -I src -I test -I src-care -I src-bin -o src/topkg_vcs.cmi src/topkg_vcs.mli
- ocamlfind ocamlopt -c -g -bin-annot -safe-string -I src -I test -I src-care -I src-bin -o src/topkg_vcs.cmx src/topkg_vcs.ml
- ocamlfind ocamlopt -c -g -bin-annot -safe-string -I src -I test -I src-care -I src-bin -o src/topkg_conf.cmx src/topkg_conf.ml
- ocamlfind ocamldep -modules src/topkg_distrib.ml > src/topkg_distrib.ml.depends
- ocamlfind ocamldep -modules src/topkg_distrib.mli > src/topkg_distrib.mli.depends
- ocamlfind ocamlc -c -g -bin-annot -safe-string -I src -I test -I src-care -I src-bin -o src/topkg_distrib.cmi src/topkg_distrib.mli
- ocamlfind ocamldep -modules src/topkg_opam.ml > src/topkg_opam.ml.depends
- ocamlfind ocamldep -modules src/topkg_opam.mli > src/topkg_opam.mli.depends
- ocamlfind ocamlc -c -g -bin-annot -safe-string -I src -I test -I src-care -I src-bin -o src/topkg_opam.cmi src/topkg_opam.mli
- ocamlfind ocamlopt -c -g -bin-annot -safe-string -I src -I test -I src-care -I src-bin -o src/topkg_opam.cmx src/topkg_opam.ml
- ocamlfind ocamldep -modules src/topkg_fexts.ml > src/topkg_fexts.ml.depends
- ocamlfind ocamldep -modules src/topkg_fexts.mli > src/topkg_fexts.mli.depends
- ocamlfind ocamlc -c -g -bin-annot -safe-string -I src -I test -I src-care -I src-bin -o src/topkg_fexts.cmi src/topkg_fexts.mli
- ocamlfind ocamldep -modules src/topkg_install.ml > src/topkg_install.ml.depends
- ocamlfind ocamldep -modules src/topkg_install.mli > src/topkg_install.mli.depends
- ocamlfind ocamldep -modules src/topkg_test.mli > src/topkg_test.mli.depends
- ocamlfind ocamlc -c -g -bin-annot -safe-string -I src -I test -I src-care -I src-bin -o src/topkg_test.cmi src/topkg_test.mli
- ocamlfind ocamlc -c -g -bin-annot -safe-string -I src -I test -I src-care -I src-bin -o src/topkg_install.cmi src/topkg_install.mli
- ocamlfind ocamlopt -c -g -bin-annot -safe-string -I src -I test -I src-care -I src-bin -o src/topkg_fexts.cmx src/topkg_fexts.ml
- ocamlfind ocamldep -modules src/topkg_test.ml > src/topkg_test.ml.depends
- ocamlfind ocamlopt -c -g -bin-annot -safe-string -I src -I test -I src-care -I src-bin -o src/topkg_test.cmx src/topkg_test.ml
- ocamlfind ocamldep -modules src/topkg_ipc.ml > src/topkg_ipc.ml.depends
- ocamlfind ocamldep -modules src/topkg_ipc.mli > src/topkg_ipc.mli.depends
- ocamlfind ocamldep -modules src/topkg_pkg.mli > src/topkg_pkg.mli.depends
- ocamlfind ocamldep -modules src/topkg_publish.mli > src/topkg_publish.mli.depends
- ocamlfind ocamlc -c -g -bin-annot -safe-string -I src -I test -I src-care -I src-bin -o src/topkg_publish.cmi src/topkg_publish.mli
- ocamlfind ocamlc -c -g -bin-annot -safe-string -I src -I test -I src-care -I src-bin -o src/topkg_pkg.cmi src/topkg_pkg.mli
- ocamlfind ocamlc -c -g -bin-annot -safe-string -I src -I test -I src-care -I src-bin -o src/topkg_ipc.cmi src/topkg_ipc.mli
- ocamlfind ocamldep -modules src/topkg_pkg.ml > src/topkg_pkg.ml.depends
- ocamlfind ocamlopt -c -g -bin-annot -safe-string -I src -I test -I src-care -I src-bin -o src/topkg_build.cmx src/topkg_build.ml
- ocamlfind ocamlopt -c -g -bin-annot -safe-string -I src -I test -I src-care -I src-bin -o src/topkg_distrib.cmx src/topkg_distrib.ml
- ocamlfind ocamlopt -c -g -bin-annot -safe-string -I src -I test -I src-care -I src-bin -o src/topkg_install.cmx src/topkg_install.ml
- ocamlfind ocamldep -modules src/topkg_publish.ml > src/topkg_publish.ml.depends
- ocamlfind ocamlopt -c -g -bin-annot -safe-string -I src -I test -I src-care -I src-bin -o src/topkg_publish.cmx src/topkg_publish.ml
- ocamlfind ocamlopt -c -g -bin-annot -safe-string -I src -I test -I src-care -I src-bin -o src/topkg_pkg.cmx src/topkg_pkg.ml
- ocamlfind ocamldep -modules src/topkg_main.ml > src/topkg_main.ml.depends
- ocamlfind ocamldep -modules src/topkg_main.mli > src/topkg_main.mli.depends
- ocamlfind ocamlc -c -g -bin-annot -safe-string -I src -I test -I src-care -I src-bin -o src/topkg_main.cmi src/topkg_main.mli
- ocamlfind ocamlopt -c -g -bin-annot -safe-string -I src -I test -I src-care -I src-bin -o src/topkg_ipc.cmx src/topkg_ipc.ml
- ocamlfind ocamlopt -c -g -bin-annot -safe-string -I src -I test -I src-care -I src-bin -o src/topkg_main.cmx src/topkg_main.ml
- ocamlfind ocamlopt -c -g -bin-annot -safe-string -I src -I test -I src-care -I src-bin -o src/topkg.cmx src/topkg.ml
- ocamlfind ocamlopt -a -I src src/topkg_string.cmx src/topkg_fpath.cmx src/topkg_cmd.cmx src/topkg_result.cmx src/topkg_log.cmx src/topkg_os.cmx src/topkg_codec.cmx src/topkg_vcs.cmx src/topkg_conf.cmx src/topkg_build.cmx src/topkg_opam.cmx src/topkg_distrib.cmx src/topkg_fexts.cmx src/topkg_test.cmx src/topkg_install.cmx src/topkg_publish.cmx src/topkg_pkg.cmx src/topkg_ipc.cmx src/topkg_main.cmx src/topkg.cmx -o src/topkg.cmxa
- ocamlfind ocamlopt -shared -linkall -I src src/topkg.cmxa -o src/topkg.cmxs
- ocamlfind ocamlc -c -g -bin-annot -safe-string -I src -I test -I src-care -I src-bin -o src/topkg.cmo src/topkg.ml
- ocamlfind ocamlc -c -g -bin-annot -safe-string -I src -I test -I src-care -I src-bin -o src/topkg_build.cmo src/topkg_build.ml
- ocamlfind ocamlc -c -g -bin-annot -safe-string -I src -I test -I src-care -I src-bin -o src/topkg_cmd.cmo src/topkg_cmd.ml
- ocamlfind ocamlc -c -g -bin-annot -safe-string -I src -I test -I src-care -I src-bin -o src/topkg_codec.cmo src/topkg_codec.ml
- ocamlfind ocamlc -c -g -bin-annot -safe-string -I src -I test -I src-care -I src-bin -o src/topkg_conf.cmo src/topkg_conf.ml
- ocamlfind ocamlc -c -g -bin-annot -safe-string -I src -I test -I src-care -I src-bin -o src/topkg_distrib.cmo src/topkg_distrib.ml
- ocamlfind ocamlc -c -g -bin-annot -safe-string -I src -I test -I src-care -I src-bin -o src/topkg_fexts.cmo src/topkg_fexts.ml
- ocamlfind ocamlc -c -g -bin-annot -safe-string -I src -I test -I src-care -I src-bin -o src/topkg_fpath.cmo src/topkg_fpath.ml
- ocamlfind ocamlc -c -g -bin-annot -safe-string -I src -I test -I src-care -I src-bin -o src/topkg_install.cmo src/topkg_install.ml
- ocamlfind ocamlc -c -g -bin-annot -safe-string -I src -I test -I src-care -I src-bin -o src/topkg_ipc.cmo src/topkg_ipc.ml
- ocamlfind ocamlc -c -g -bin-annot -safe-string -I src -I test -I src-care -I src-bin -o src/topkg_log.cmo src/topkg_log.ml
- ocamlfind ocamlc -c -g -bin-annot -safe-string -I src -I test -I src-care -I src-bin -o src/topkg_main.cmo src/topkg_main.ml
- ocamlfind ocamlc -c -g -bin-annot -safe-string -I src -I test -I src-care -I src-bin -o src/topkg_opam.cmo src/topkg_opam.ml
- ocamlfind ocamlc -c -g -bin-annot -safe-string -I src -I test -I src-care -I src-bin -o src/topkg_os.cmo src/topkg_os.ml
- ocamlfind ocamlc -c -g -bin-annot -safe-string -I src -I test -I src-care -I src-bin -o src/topkg_pkg.cmo src/topkg_pkg.ml
- ocamlfind ocamlc -c -g -bin-annot -safe-string -I src -I test -I src-care -I src-bin -o src/topkg_publish.cmo src/topkg_publish.ml
- ocamlfind ocamlc -c -g -bin-annot -safe-string -I src -I test -I src-care -I src-bin -o src/topkg_result.cmo src/topkg_result.ml
- ocamlfind ocamlc -c -g -bin-annot -safe-string -I src -I test -I src-care -I src-bin -o src/topkg_string.cmo src/topkg_string.ml
- ocamlfind ocamlc -c -g -bin-annot -safe-string -I src -I test -I src-care -I src-bin -o src/topkg_test.cmo src/topkg_test.ml
- ocamlfind ocamlc -c -g -bin-annot -safe-string -I src -I test -I src-care -I src-bin -o src/topkg_vcs.cmo src/topkg_vcs.ml
- ocamlfind ocamlc -a -I src src/topkg_string.cmo src/topkg_fpath.cmo src/topkg_cmd.cmo src/topkg_result.cmo src/topkg_log.cmo src/topkg_os.cmo src/topkg_codec.cmo src/topkg_vcs.cmo src/topkg_conf.cmo src/topkg_build.cmo src/topkg_opam.cmo src/topkg_distrib.cmo src/topkg_fexts.cmo src/topkg_test.cmo src/topkg_install.cmo src/topkg_publish.cmo src/topkg_pkg.cmo src/topkg_ipc.cmo src/topkg_main.cmo src/topkg.cmo -o src/topkg.cma
- # Parallel statistics: { count(total): 2(84), max: 20, min: 2, average(total): 11.000(1.238) }
-> compiled  topkg.1.0.7
-> installed topkg.1.0.7
Processing 67/78: [fmt: ocaml build]
+ /home/opam/.opam/4.14/bin/ocaml "pkg/pkg.ml" "build" "--dev-pkg" "false" "--with-base-unix" "true" "--with-cmdliner" "true" (CWD=/home/opam/.opam/4.14/.opam-switch/build/fmt.0.9.0)
- ocamlfind ocamldep -modules src/fmt.ml > src/fmt.ml.depends
- ocamlfind ocamldep -modules src/fmt.mli > src/fmt.mli.depends
- ocamlfind ocamlc -c -g -bin-annot -safe-string -I src -I test -o src/fmt.cmi src/fmt.mli
- ocamlfind ocamlopt -c -g -bin-annot -safe-string -I src -I test -o src/fmt.cmx src/fmt.ml
- ocamlfind ocamlopt -a -I src src/fmt.cmx -o src/fmt.cmxa
- ocamlfind ocamlopt -shared -linkall -I src src/fmt.cmxa -o src/fmt.cmxs
- ocamlfind ocamlc -c -g -bin-annot -safe-string -I src -I test -o src/fmt.cmo src/fmt.ml
- ocamlfind ocamlc -a -I src src/fmt.cmo -o src/fmt.cma
- ocamlfind ocamldep -package unix -modules src/fmt_tty.ml > src/fmt_tty.ml.depends
- ocamlfind ocamldep -package unix -modules src/fmt_tty.mli > src/fmt_tty.mli.depends
- ocamlfind ocamlc -c -g -bin-annot -safe-string -package unix -I src -I test -o src/fmt_tty.cmi src/fmt_tty.mli
- ocamlfind ocamlopt -c -g -bin-annot -safe-string -package unix -I src -I test -o src/fmt_tty.cmx src/fmt_tty.ml
- + ocamlfind ocamlopt -c -g -bin-annot -safe-string -package unix -I src -I test -o src/fmt_tty.cmx src/fmt_tty.ml
- File "src/fmt_tty.ml", line 49, characters 12-20:
- 49 |         try is_infix "UTF-8" (String.uppercase_ascii (Sys.getenv var))
-                  ^^^^^^^^
- Warning 6 [labels-omitted]: label affix was omitted in the application of this function.
- ocamlfind ocamlopt -a -package unix -I src src/fmt_tty.cmx -o src/fmt_tty.cmxa
- ocamlfind ocamlopt -shared -linkall -package unix -I src src/fmt_tty.cmxa -o src/fmt_tty.cmxs
- ocamlfind ocamlc -c -g -bin-annot -safe-string -package unix -I src -I test -o src/fmt_tty.cmo src/fmt_tty.ml
- + ocamlfind ocamlc -c -g -bin-annot -safe-string -package unix -I src -I test -o src/fmt_tty.cmo src/fmt_tty.ml
- File "src/fmt_tty.ml", line 49, characters 12-20:
- 49 |         try is_infix "UTF-8" (String.uppercase_ascii (Sys.getenv var))
-                  ^^^^^^^^
- Warning 6 [labels-omitted]: label affix was omitted in the application of this function.
- ocamlfind ocamlc -a -package unix -I src src/fmt_tty.cmo -o src/fmt_tty.cma
- ocamlfind ocamldep -package cmdliner -modules src/fmt_cli.ml > src/fmt_cli.ml.depends
- ocamlfind ocamldep -package cmdliner -modules src/fmt_cli.mli > src/fmt_cli.mli.depends
- ocamlfind ocamlc -c -g -bin-annot -safe-string -package cmdliner -I src -I test -o src/fmt_cli.cmi src/fmt_cli.mli
- + ocamlfind ocamlc -c -g -bin-annot -safe-string -package cmdliner -I src -I test -o src/fmt_cli.cmi src/fmt_cli.mli
- File "src/fmt_cli.mli", line 10, characters 26-42:
- 10 | val style_renderer : ?env:Cmdliner.Arg.env -> ?docs:string -> unit ->
-                                ^^^^^^^^^^^^^^^^
- Alert deprecated: Cmdliner.Arg.env
- Use Cmd.Env.info instead.
- ocamlfind ocamlopt -c -g -bin-annot -safe-string -package cmdliner -I src -I test -o src/fmt_cli.cmx src/fmt_cli.ml
- ocamlfind ocamlopt -a -package cmdliner -I src src/fmt_cli.cmx -o src/fmt_cli.cmxa
- ocamlfind ocamlopt -shared -linkall -package cmdliner -I src src/fmt_cli.cmxa -o src/fmt_cli.cmxs
- ocamlfind ocamlc -c -g -bin-annot -safe-string -package cmdliner -I src -I test -o src/fmt_cli.cmo src/fmt_cli.ml
- ocamlfind ocamlc -a -package cmdliner -I src src/fmt_cli.cmo -o src/fmt_cli.cma
- ocamlfind ocamldep -package compiler-libs.toplevel -modules src/fmt_top.ml > src/fmt_top.ml.depends
- ocamlfind ocamlc -c -g -bin-annot -safe-string -package compiler-libs.toplevel -I src -I test -o src/fmt_top.cmo src/fmt_top.ml
- + ocamlfind ocamlc -c -g -bin-annot -safe-string -package compiler-libs.toplevel -I src -I test -o src/fmt_top.cmo src/fmt_top.ml
- findlib: [WARNING] Interface topdirs.cmi occurs in several directories: /home/opam/.opam/4.14/lib/ocaml, /home/opam/.opam/4.14/lib/ocaml/compiler-libs
- ocamlfind ocamlopt -c -g -bin-annot -safe-string -package compiler-libs.toplevel -I src -I test -o src/fmt_top.cmx src/fmt_top.ml
- + ocamlfind ocamlopt -c -g -bin-annot -safe-string -package compiler-libs.toplevel -I src -I test -o src/fmt_top.cmx src/fmt_top.ml
- findlib: [WARNING] Interface topdirs.cmi occurs in several directories: /home/opam/.opam/4.14/lib/ocaml, /home/opam/.opam/4.14/lib/ocaml/compiler-libs
- ocamlfind ocamlopt -a -package compiler-libs.toplevel -I src src/fmt_top.cmx -o src/fmt_top.cmxa
- + ocamlfind ocamlopt -a -package compiler-libs.toplevel -I src src/fmt_top.cmx -o src/fmt_top.cmxa
- findlib: [WARNING] Interface topdirs.cmi occurs in several directories: /home/opam/.opam/4.14/lib/ocaml, /home/opam/.opam/4.14/lib/ocaml/compiler-libs
- ocamlfind ocamlopt -shared -linkall -package compiler-libs.toplevel -I src src/fmt_top.cmxa -o src/fmt_top.cmxs
- + ocamlfind ocamlopt -shared -linkall -package compiler-libs.toplevel -I src src/fmt_top.cmxa -o src/fmt_top.cmxs
- findlib: [WARNING] Interface topdirs.cmi occurs in several directories: /home/opam/.opam/4.14/lib/ocaml, /home/opam/.opam/4.14/lib/ocaml/compiler-libs
- ocamlfind ocamlc -a -package compiler-libs.toplevel -I src src/fmt_top.cmo -o src/fmt_top.cma
- + ocamlfind ocamlc -a -package compiler-libs.toplevel -I src src/fmt_top.cmo -o src/fmt_top.cma
- findlib: [WARNING] Interface topdirs.cmi occurs in several directories: /home/opam/.opam/4.14/lib/ocaml, /home/opam/.opam/4.14/lib/ocaml/compiler-libs
- # No parallelism done
-> compiled  fmt.0.9.0
-> installed fmt.0.9.0
Processing 69/78: [cstruct: dune build]
Processing 70/78: [cstruct: dune build] [logs: ocaml build]
Processing 71/78: [cstruct: dune build] [logs: ocaml build] [metrics: dune build]
-> compiled  metrics.0.4.1
Processing 71/78: [cstruct: dune build] [logs: ocaml build]
-> installed metrics.0.4.1
Processing 72/78: [cstruct: dune build] [logs: ocaml build]
-> compiled  cstruct.6.2.0
Processing 72/78: [logs: ocaml build]
-> installed cstruct.6.2.0
Processing 73/78: [logs: ocaml build]
+ /home/opam/.opam/4.14/bin/ocaml "pkg/pkg.ml" "build" "--pinned" "false" "--with-js_of_ocaml" "false" "--with-fmt" "true" "--with-cmdliner" "true" "--with-lwt" "true" "--with-base-threads" "true" (CWD=/home/opam/.opam/4.14/.opam-switch/build/logs.0.7.0)
- ocamlfind ocamldep -modules src/logs.ml > src/logs.ml.depends
- ocamlfind ocamldep -modules src/logs.mli > src/logs.mli.depends
- ocamlfind ocamlc -c -g -bin-annot -safe-string -I src -I test -o src/logs.cmi src/logs.mli
- ocamlfind ocamlopt -c -g -bin-annot -safe-string -I src -I test -o src/logs.cmx src/logs.ml
- ocamlfind ocamlopt -a -I src src/logs.cmx -o src/logs.cmxa
- ocamlfind ocamlopt -shared -linkall -I src src/logs.cmxa -o src/logs.cmxs
- ocamlfind ocamlc -c -g -bin-annot -safe-string -I src -I test -o src/logs.cmo src/logs.ml
- ocamlfind ocamlc -a -I src src/logs.cmo -o src/logs.cma
- ocamlfind ocamldep -package fmt -modules src/logs_fmt.ml > src/logs_fmt.ml.depends
- ocamlfind ocamldep -package fmt -modules src/logs_fmt.mli > src/logs_fmt.mli.depends
- ocamlfind ocamlc -c -g -bin-annot -safe-string -package fmt -I src -I test -o src/logs_fmt.cmi src/logs_fmt.mli
- ocamlfind ocamlopt -c -g -bin-annot -safe-string -package fmt -I src -I test -o src/logs_fmt.cmx src/logs_fmt.ml
- ocamlfind ocamlopt -a -package fmt -I src src/logs_fmt.cmx -o src/logs_fmt.cmxa
- ocamlfind ocamlopt -shared -linkall -package fmt -I src src/logs_fmt.cmxa -o src/logs_fmt.cmxs
- ocamlfind ocamlc -c -g -bin-annot -safe-string -package fmt -I src -I test -o src/logs_fmt.cmo src/logs_fmt.ml
- ocamlfind ocamlc -a -package fmt -I src src/logs_fmt.cmo -o src/logs_fmt.cma
- ocamlfind ocamldep -package cmdliner -modules src/logs_cli.ml > src/logs_cli.ml.depends
- ocamlfind ocamldep -package cmdliner -modules src/logs_cli.mli > src/logs_cli.mli.depends
- ocamlfind ocamlc -c -g -bin-annot -safe-string -package cmdliner -I src -I test -o src/logs_cli.cmi src/logs_cli.mli
- + ocamlfind ocamlc -c -g -bin-annot -safe-string -package cmdliner -I src -I test -o src/logs_cli.cmi src/logs_cli.mli
- File "src/logs_cli.mli", line 15, characters 17-33:
- 15 | val level : ?env:Cmdliner.Arg.env -> ?docs:string -> unit ->
-                       ^^^^^^^^^^^^^^^^
- Alert deprecated: Cmdliner.Arg.env
- Use Cmd.Env.info instead.
- ocamlfind ocamlopt -c -g -bin-annot -safe-string -package cmdliner -I src -I test -o src/logs_cli.cmx src/logs_cli.ml
- ocamlfind ocamlopt -a -package cmdliner -I src src/logs_cli.cmx -o src/logs_cli.cmxa
- ocamlfind ocamlopt -shared -linkall -package cmdliner -I src src/logs_cli.cmxa -o src/logs_cli.cmxs
- ocamlfind ocamlc -c -g -bin-annot -safe-string -package cmdliner -I src -I test -o src/logs_cli.cmo src/logs_cli.ml
- ocamlfind ocamlc -a -package cmdliner -I src src/logs_cli.cmo -o src/logs_cli.cma
- ocamlfind ocamldep -package lwt -modules src/logs_lwt.ml > src/logs_lwt.ml.depends
- ocamlfind ocamldep -package lwt -modules src/logs_lwt.mli > src/logs_lwt.mli.depends
- ocamlfind ocamlc -c -g -bin-annot -safe-string -package lwt -I src -I test -o src/logs_lwt.cmi src/logs_lwt.mli
- ocamlfind ocamlopt -c -g -bin-annot -safe-string -package lwt -I src -I test -o src/logs_lwt.cmx src/logs_lwt.ml
- ocamlfind ocamlopt -a -package lwt -I src src/logs_lwt.cmx -o src/logs_lwt.cmxa
- ocamlfind ocamlopt -shared -linkall -package lwt -I src src/logs_lwt.cmxa -o src/logs_lwt.cmxs
- ocamlfind ocamlc -c -g -bin-annot -safe-string -package lwt -I src -I test -o src/logs_lwt.cmo src/logs_lwt.ml
- ocamlfind ocamlc -a -package lwt -I src src/logs_lwt.cmo -o src/logs_lwt.cma
- ocamlfind ocamldep -package compiler-libs.toplevel -modules src/logs_top.ml > src/logs_top.ml.depends
- ocamlfind ocamlc -c -g -bin-annot -safe-string -package compiler-libs.toplevel -I src -I test -o src/logs_top.cmo src/logs_top.ml
- + ocamlfind ocamlc -c -g -bin-annot -safe-string -package compiler-libs.toplevel -I src -I test -o src/logs_top.cmo src/logs_top.ml
- findlib: [WARNING] Interface topdirs.cmi occurs in several directories: /home/opam/.opam/4.14/lib/ocaml, /home/opam/.opam/4.14/lib/ocaml/compiler-libs
- ocamlfind ocamlopt -c -g -bin-annot -safe-string -package compiler-libs.toplevel -I src -I test -o src/logs_top.cmx src/logs_top.ml
- + ocamlfind ocamlopt -c -g -bin-annot -safe-string -package compiler-libs.toplevel -I src -I test -o src/logs_top.cmx src/logs_top.ml
- findlib: [WARNING] Interface topdirs.cmi occurs in several directories: /home/opam/.opam/4.14/lib/ocaml, /home/opam/.opam/4.14/lib/ocaml/compiler-libs
- ocamlfind ocamlopt -a -package compiler-libs.toplevel -I src src/logs_top.cmx -o src/logs_top.cmxa
- + ocamlfind ocamlopt -a -package compiler-libs.toplevel -I src src/logs_top.cmx -o src/logs_top.cmxa
- findlib: [WARNING] Interface topdirs.cmi occurs in several directories: /home/opam/.opam/4.14/lib/ocaml, /home/opam/.opam/4.14/lib/ocaml/compiler-libs
- ocamlfind ocamlopt -shared -linkall -package compiler-libs.toplevel -I src src/logs_top.cmxa -o src/logs_top.cmxs
- + ocamlfind ocamlopt -shared -linkall -package compiler-libs.toplevel -I src src/logs_top.cmxa -o src/logs_top.cmxs
- findlib: [WARNING] Interface topdirs.cmi occurs in several directories: /home/opam/.opam/4.14/lib/ocaml, /home/opam/.opam/4.14/lib/ocaml/compiler-libs
- ocamlfind ocamlc -a -package compiler-libs.toplevel -I src src/logs_top.cmo -o src/logs_top.cma
- + ocamlfind ocamlc -a -package compiler-libs.toplevel -I src src/logs_top.cmo -o src/logs_top.cma
- findlib: [WARNING] Interface topdirs.cmi occurs in several directories: /home/opam/.opam/4.14/lib/ocaml, /home/opam/.opam/4.14/lib/ocaml/compiler-libs
- ocamlfind ocamldep -package threads -modules src/logs_threaded.ml > src/logs_threaded.ml.depends
- ocamlfind ocamldep -package threads -modules src/logs_threaded.mli > src/logs_threaded.mli.depends
- ocamlfind ocamlc -c -g -bin-annot -safe-string -thread -package threads -I src -I test -o src/logs_threaded.cmi src/logs_threaded.mli
- ocamlfind ocamlopt -c -g -bin-annot -safe-string -thread -package threads -I src -I test -o src/logs_threaded.cmx src/logs_threaded.ml
- ocamlfind ocamlopt -a -thread -package threads -I src src/logs_threaded.cmx -o src/logs_threaded.cmxa
- ocamlfind ocamlopt -shared -linkall -thread -package threads -I src src/logs_threaded.cmxa -o src/logs_threaded.cmxs
- ocamlfind ocamlc -c -g -bin-annot -safe-string -thread -package threads -I src -I test -o src/logs_threaded.cmo src/logs_threaded.ml
- ocamlfind ocamlc -a -thread -package threads -I src src/logs_threaded.cmo -o src/logs_threaded.cma
- # No parallelism done
-> compiled  logs.0.7.0
-> installed logs.0.7.0
Processing 75/78: [mirage-runtime: dune build]
+ /home/opam/.opam/4.14/bin/dune "build" "-p" "mirage-runtime" "-j" "255" (CWD=/home/opam/.opam/4.14/.opam-switch/build/mirage-runtime.4.4.1)
-> compiled  mirage-runtime.4.4.1
-> installed mirage-runtime.4.4.1

#=== ERROR while compiling solo5-bindings-hvt.0.6.9 ===========================#
# context              2.1.5 | linux/x86_64 | ocaml-base-compiler.4.14.1 | file:///src
# path                 ~/.opam/4.14/.opam-switch/build/solo5-bindings-hvt.0.6.9
# command              /usr/bin/make V=1 CONFIG_SPT= CONFIG_VIRTIO= CONFIG_MUEN= CONFIG_GENODE= CONFIG_XEN=
# exit-code            2
# env-file             ~/.opam/log/solo5-bindings-hvt-113-f558ae.env
# output-file          ~/.opam/log/solo5-bindings-hvt-113-f558ae.out
### output ###
# GEN include/solo5/solo5_version.h
# scripts/gen_version_h.sh include/solo5/solo5_version.h
# MAKE bindings
# /usr/bin/make -C bindings  
# make[1]: Entering directory '/home/opam/.opam/4.14/.opam-switch/build/solo5-bindings-hvt.0.6.9/bindings'
# CC hvt/start.o
# cc -MT hvt/start.o -MMD -MP -MF hvt/start.Td -std=c11 -Wall -Wextra -Werror -O2 -g -ffreestanding -fstack-protector-strong -nostdinc -mstack-protector-guard=global -mno-sse -mno-mmx -mno-aes -mno-avx -mno-red-zone -isystem /home/opam/.opam/4.14/.opam-switch/build/solo5-bindings-hvt.0.6.9/include/crt -I/home/opam/.opam/4.14/.opam-switch/build/solo5-bindings-hvt.0.6.9/include/solo5 -D__SOLO5_BINDINGS__ -c hvt/start.c -o hvt/start.o
# mv -f hvt/start.Td hvt/start.d && touch hvt/start.o
# CC abort.o
# cc -MT abort.o -MMD -MP -MF abort.Td -std=c11 -Wall -Wextra -Werror -O2 -g -ffreestanding -fstack-protector-strong -nostdinc -mstack-protector-guard=global -mno-sse -mno-mmx -mno-aes -mno-avx -mno-red-zone -isystem /home/opam/.opam/4.14/.opam-switch/build/solo5-bindings-hvt.0.6.9/include/crt -I/home/opam/.opam/4.14/.opam-switch/build/solo5-bindings-hvt.0.6.9/include/solo5 -D__SOLO5_BINDINGS__ -c abort.c -o abort.o
# mv -f abort.Td abort.d && touch abort.o
# CC cpu_x86_64.o
# cc -MT cpu_x86_64.o -MMD -MP -MF cpu_x86_64.Td -std=c11 -Wall -Wextra -Werror -O2 -g -ffreestanding -fstack-protector-strong -nostdinc -mstack-protector-guard=global -mno-sse -mno-mmx -mno-aes -mno-avx -mno-red-zone -isystem /home/opam/.opam/4.14/.opam-switch/build/solo5-bindings-hvt.0.6.9/include/crt -I/home/opam/.opam/4.14/.opam-switch/build/solo5-bindings-hvt.0.6.9/include/solo5 -D__SOLO5_BINDINGS__ -c cpu_x86_64.c -o cpu_x86_64.o
# mv -f cpu_x86_64.Td cpu_x86_64.d && touch cpu_x86_64.o
# AS cpu_vectors_x86_64.o
# cc -MT cpu_vectors_x86_64.o -MMD -MP -MF cpu_vectors_x86_64.Td -std=c11 -Wall -Wextra -Werror -O2 -g -ffreestanding -fstack-protector-strong -nostdinc -mstack-protector-guard=global -mno-sse -mno-mmx -mno-aes -mno-avx -mno-red-zone -isystem /home/opam/.opam/4.14/.opam-switch/build/solo5-bindings-hvt.0.6.9/include/crt -I/home/opam/.opam/4.14/.opam-switch/build/solo5-bindings-hvt.0.6.9/include/solo5 -D__SOLO5_BINDINGS__ -DASM_FILE -c cpu_vectors_x86_64.S -o cpu_vectors_x86_64.o
# mv -f cpu_vectors_x86_64.Td cpu_vectors_x86_64.d && touch cpu_vectors_x86_64.o
# CC crt.o
# cc -MT crt.o -MMD -MP -MF crt.Td -std=c11 -Wall -Wextra -Werror -O2 -g -ffreestanding -fstack-protector-strong -nostdinc -mstack-protector-guard=global -mno-sse -mno-mmx -mno-aes -mno-avx -mno-red-zone -isystem /home/opam/.opam/4.14/.opam-switch/build/solo5-bindings-hvt.0.6.9/include/crt -I/home/opam/.opam/4.14/.opam-switch/build/solo5-bindings-hvt.0.6.9/include/solo5 -D__SOLO5_BINDINGS__ -c crt.c -o crt.o
# mv -f crt.Td crt.d && touch crt.o
# CC printf.o
# cc -MT printf.o -MMD -MP -MF printf.Td -std=c11 -Wall -Wextra -Werror -O2 -g -ffreestanding -fstack-protector-strong -nostdinc -mstack-protector-guard=global -mno-sse -mno-mmx -mno-aes -mno-avx -mno-red-zone -isystem /home/opam/.opam/4.14/.opam-switch/build/solo5-bindings-hvt.0.6.9/include/crt -I/home/opam/.opam/4.14/.opam-switch/build/solo5-bindings-hvt.0.6.9/include/solo5 -D__SOLO5_BINDINGS__ -c printf.c -o printf.o
# mv -f printf.Td printf.d && touch printf.o
# CC intr.o
# cc -MT intr.o -MMD -MP -MF intr.Td -std=c11 -Wall -Wextra -Werror -O2 -g -ffreestanding -fstack-protector-strong -nostdinc -mstack-protector-guard=global -mno-sse -mno-mmx -mno-aes -mno-avx -mno-red-zone -isystem /home/opam/.opam/4.14/.opam-switch/build/solo5-bindings-hvt.0.6.9/include/crt -I/home/opam/.opam/4.14/.opam-switch/build/solo5-bindings-hvt.0.6.9/include/solo5 -D__SOLO5_BINDINGS__ -c intr.c -o intr.o
# mv -f intr.Td intr.d && touch intr.o
# CC lib.o
# cc -MT lib.o -MMD -MP -MF lib.Td -std=c11 -Wall -Wextra -Werror -O2 -g -ffreestanding -fstack-protector-strong -nostdinc -mstack-protector-guard=global -mno-sse -mno-mmx -mno-aes -mno-avx -mno-red-zone -isystem /home/opam/.opam/4.14/.opam-switch/build/solo5-bindings-hvt.0.6.9/include/crt -I/home/opam/.opam/4.14/.opam-switch/build/solo5-bindings-hvt.0.6.9/include/solo5 -D__SOLO5_BINDINGS__ -c lib.c -o lib.o
# mv -f lib.Td lib.d && touch lib.o
# CC mem.o
# cc -MT mem.o -MMD -MP -MF mem.Td -std=c11 -Wall -Wextra -Werror -O2 -g -ffreestanding -fstack-protector-strong -nostdinc -mstack-protector-guard=global -mno-sse -mno-mmx -mno-aes -mno-avx -mno-red-zone -isystem /home/opam/.opam/4.14/.opam-switch/build/solo5-bindings-hvt.0.6.9/include/crt -I/home/opam/.opam/4.14/.opam-switch/build/solo5-bindings-hvt.0.6.9/include/solo5 -D__SOLO5_BINDINGS__ -c mem.c -o mem.o
# mv -f mem.Td mem.d && touch mem.o
# CC exit.o
# cc -MT exit.o -MMD -MP -MF exit.Td -std=c11 -Wall -Wextra -Werror -O2 -g -ffreestanding -fstack-protector-strong -nostdinc -mstack-protector-guard=global -mno-sse -mno-mmx -mno-aes -mno-avx -mno-red-zone -isystem /home/opam/.opam/4.14/.opam-switch/build/solo5-bindings-hvt.0.6.9/include/crt -I/home/opam/.opam/4.14/.opam-switch/build/solo5-bindings-hvt.0.6.9/include/solo5 -D__SOLO5_BINDINGS__ -c exit.c -o exit.o
# mv -f exit.Td exit.d && touch exit.o
# CC log.o
# cc -MT log.o -MMD -MP -MF log.Td -std=c11 -Wall -Wextra -Werror -O2 -g -ffreestanding -fstack-protector-strong -nostdinc -mstack-protector-guard=global -mno-sse -mno-mmx -mno-aes -mno-avx -mno-red-zone -isystem /home/opam/.opam/4.14/.opam-switch/build/solo5-bindings-hvt.0.6.9/include/crt -I/home/opam/.opam/4.14/.opam-switch/build/solo5-bindings-hvt.0.6.9/include/solo5 -D__SOLO5_BINDINGS__ -c log.c -o log.o
# mv -f log.Td log.d && touch log.o
# CC cmdline.o
# cc -MT cmdline.o -MMD -MP -MF cmdline.Td -std=c11 -Wall -Wextra -Werror -O2 -g -ffreestanding -fstack-protector-strong -nostdinc -mstack-protector-guard=global -mno-sse -mno-mmx -mno-aes -mno-avx -mno-red-zone -isystem /home/opam/.opam/4.14/.opam-switch/build/solo5-bindings-hvt.0.6.9/include/crt -I/home/opam/.opam/4.14/.opam-switch/build/solo5-bindings-hvt.0.6.9/include/solo5 -D__SOLO5_BINDINGS__ -c cmdline.c -o cmdline.o
# mv -f cmdline.Td cmdline.d && touch cmdline.o
# CC tls.o
# cc -MT tls.o -MMD -MP -MF tls.Td -std=c11 -Wall -Wextra -Werror -O2 -g -ffreestanding -fstack-protector-strong -nostdinc -mstack-protector-guard=global -mno-sse -mno-mmx -mno-aes -mno-avx -mno-red-zone -isystem /home/opam/.opam/4.14/.opam-switch/build/solo5-bindings-hvt.0.6.9/include/crt -I/home/opam/.opam/4.14/.opam-switch/build/solo5-bindings-hvt.0.6.9/include/solo5 -D__SOLO5_BINDINGS__ -c tls.c -o tls.o
# mv -f tls.Td tls.d && touch tls.o
# CC mft.o
# cc -MT mft.o -MMD -MP -MF mft.Td -std=c11 -Wall -Wextra -Werror -O2 -g -ffreestanding -fstack-protector-strong -nostdinc -mstack-protector-guard=global -mno-sse -mno-mmx -mno-aes -mno-avx -mno-red-zone -isystem /home/opam/.opam/4.14/.opam-switch/build/solo5-bindings-hvt.0.6.9/include/crt -I/home/opam/.opam/4.14/.opam-switch/build/solo5-bindings-hvt.0.6.9/include/solo5 -D__SOLO5_BINDINGS__ -c mft.c -o mft.o
# mv -f mft.Td mft.d && touch mft.o
# CC hvt/platform.o
# cc -MT hvt/platform.o -MMD -MP -MF hvt/platform.Td -std=c11 -Wall -Wextra -Werror -O2 -g -ffreestanding -fstack-protector-strong -nostdinc -mstack-protector-guard=global -mno-sse -mno-mmx -mno-aes -mno-avx -mno-red-zone -isystem /home/opam/.opam/4.14/.opam-switch/build/solo5-bindings-hvt.0.6.9/include/crt -I/home/opam/.opam/4.14/.opam-switch/build/solo5-bindings-hvt.0.6.9/include/solo5 -D__SOLO5_BINDINGS__ -c hvt/platform.c -o hvt/platform.o
# mv -f hvt/platform.Td hvt/platform.d && touch hvt/platform.o
# CC hvt/platform_intr.o
# cc -MT hvt/platform_intr.o -MMD -MP -MF hvt/platform_intr.Td -std=c11 -Wall -Wextra -Werror -O2 -g -ffreestanding -fstack-protector-strong -nostdinc -mstack-protector-guard=global -mno-sse -mno-mmx -mno-aes -mno-avx -mno-red-zone -isystem /home/opam/.opam/4.14/.opam-switch/build/solo5-bindings-hvt.0.6.9/include/crt -I/home/opam/.opam/4.14/.opam-switch/build/solo5-bindings-hvt.0.6.9/include/solo5 -D__SOLO5_BINDINGS__ -c hvt/platform_intr.c -o hvt/platform_intr.o
# mv -f hvt/platform_intr.Td hvt/platform_intr.d && touch hvt/platform_intr.o
# CC hvt/time.o
# cc -MT hvt/time.o -MMD -MP -MF hvt/time.Td -std=c11 -Wall -Wextra -Werror -O2 -g -ffreestanding -fstack-protector-strong -nostdinc -mstack-protector-guard=global -mno-sse -mno-mmx -mno-aes -mno-avx -mno-red-zone -isystem /home/opam/.opam/4.14/.opam-switch/build/solo5-bindings-hvt.0.6.9/include/crt -I/home/opam/.opam/4.14/.opam-switch/build/solo5-bindings-hvt.0.6.9/include/solo5 -D__SOLO5_BINDINGS__ -c hvt/time.c -o hvt/time.o
# mv -f hvt/time.Td hvt/time.d && touch hvt/time.o
# CC hvt/platform_lifecycle.o
# cc -MT hvt/platform_lifecycle.o -MMD -MP -MF hvt/platform_lifecycle.Td -std=c11 -Wall -Wextra -Werror -O2 -g -ffreestanding -fstack-protector-strong -nostdinc -mstack-protector-guard=global -mno-sse -mno-mmx -mno-aes -mno-avx -mno-red-zone -isystem /home/opam/.opam/4.14/.opam-switch/build/solo5-bindings-hvt.0.6.9/include/crt -I/home/opam/.opam/4.14/.opam-switch/build/solo5-bindings-hvt.0.6.9/include/solo5 -D__SOLO5_BINDINGS__ -c hvt/platform_lifecycle.c -o hvt/platform_lifecycle.o
# mv -f hvt/platform_lifecycle.Td hvt/platform_lifecycle.d && touch hvt/platform_lifecycle.o
# CC hvt/yield.o
# cc -MT hvt/yield.o -MMD -MP -MF hvt/yield.Td -std=c11 -Wall -Wextra -Werror -O2 -g -ffreestanding -fstack-protector-strong -nostdinc -mstack-protector-guard=global -mno-sse -mno-mmx -mno-aes -mno-avx -mno-red-zone -isystem /home/opam/.opam/4.14/.opam-switch/build/solo5-bindings-hvt.0.6.9/include/crt -I/home/opam/.opam/4.14/.opam-switch/build/solo5-bindings-hvt.0.6.9/include/solo5 -D__SOLO5_BINDINGS__ -c hvt/yield.c -o hvt/yield.o
# mv -f hvt/yield.Td hvt/yield.d && touch hvt/yield.o
# CC hvt/tscclock.o
# cc -MT hvt/tscclock.o -MMD -MP -MF hvt/tscclock.Td -std=c11 -Wall -Wextra -Werror -O2 -g -ffreestanding -fstack-protector-strong -nostdinc -mstack-protector-guard=global -mno-sse -mno-mmx -mno-aes -mno-avx -mno-red-zone -isystem /home/opam/.opam/4.14/.opam-switch/build/solo5-bindings-hvt.0.6.9/include/crt -I/home/opam/.opam/4.14/.opam-switch/build/solo5-bindings-hvt.0.6.9/include/solo5 -D__SOLO5_BINDINGS__ -c hvt/tscclock.c -o hvt/tscclock.o
# mv -f hvt/tscclock.Td hvt/tscclock.d && touch hvt/tscclock.o
# CC hvt/console.o
# cc -MT hvt/console.o -MMD -MP -MF hvt/console.Td -std=c11 -Wall -Wextra -Werror -O2 -g -ffreestanding -fstack-protector-strong -nostdinc -mstack-protector-guard=global -mno-sse -mno-mmx -mno-aes -mno-avx -mno-red-zone -isystem /home/opam/.opam/4.14/.opam-switch/build/solo5-bindings-hvt.0.6.9/include/crt -I/home/opam/.opam/4.14/.opam-switch/build/solo5-bindings-hvt.0.6.9/include/solo5 -D__SOLO5_BINDINGS__ -c hvt/console.c -o hvt/console.o
# mv -f hvt/console.Td hvt/console.d && touch hvt/console.o
# CC hvt/net.o
# cc -MT hvt/net.o -MMD -MP -MF hvt/net.Td -std=c11 -Wall -Wextra -Werror -O2 -g -ffreestanding -fstack-protector-strong -nostdinc -mstack-protector-guard=global -mno-sse -mno-mmx -mno-aes -mno-avx -mno-red-zone -isystem /home/opam/.opam/4.14/.opam-switch/build/solo5-bindings-hvt.0.6.9/include/crt -I/home/opam/.opam/4.14/.opam-switch/build/solo5-bindings-hvt.0.6.9/include/solo5 -D__SOLO5_BINDINGS__ -c hvt/net.c -o hvt/net.o
# mv -f hvt/net.Td hvt/net.d && touch hvt/net.o
# CC hvt/block.o
# cc -MT hvt/block.o -MMD -MP -MF hvt/block.Td -std=c11 -Wall -Wextra -Werror -O2 -g -ffreestanding -fstack-protector-strong -nostdinc -mstack-protector-guard=global -mno-sse -mno-mmx -mno-aes -mno-avx -mno-red-zone -isystem /home/opam/.opam/4.14/.opam-switch/build/solo5-bindings-hvt.0.6.9/include/crt -I/home/opam/.opam/4.14/.opam-switch/build/solo5-bindings-hvt.0.6.9/include/solo5 -D__SOLO5_BINDINGS__ -c hvt/block.c -o hvt/block.o
# mv -f hvt/block.Td hvt/block.d && touch hvt/block.o
# LD hvt/solo5_hvt.o
# ld -r -nostdlib -z max-page-size=0x1000 -static  hvt/start.o abort.o cpu_x86_64.o cpu_vectors_x86_64.o crt.o printf.o intr.o lib.o mem.o exit.o log.o cmdline.o tls.o mft.o hvt/platform.o hvt/platform_intr.o hvt/time.o hvt/platform_lifecycle.o hvt/yield.o hvt/tscclock.o hvt/console.o hvt/net.o hvt/block.o -o hvt/solo5_hvt.o
# ld: warning: cpu_vectors_x86_64.o: missing .note.GNU-stack section implies executable stack
# ld: NOTE: This behaviour is deprecated and will be removed in a future version of the linker
# OBJCOPY hvt/solo5_hvt.o
# objcopy -w -G solo5_\* -G _start\* -G __stack_chk_guard -G __stack_chk_fail hvt/solo5_hvt.o hvt/solo5_hvt.o
# make[1]: Leaving directory '/home/opam/.opam/4.14/.opam-switch/build/solo5-bindings-hvt.0.6.9/bindings'
# MAKE tenders
# /usr/bin/make -C tenders  
# make[1]: Entering directory '/home/opam/.opam/4.14/.opam-switch/build/solo5-bindings-hvt.0.6.9/tenders'
# HOSTCC common/elf.o
# cc -MT common/elf.o -MMD -MP -MF common/elf.Td -Wall -Werror -std=c11 -fstack-protector-strong -O2 -g -I/home/opam/.opam/4.14/.opam-switch/build/solo5-bindings-hvt.0.6.9/include/solo5 -c common/elf.c -o common/elf.o
# mv -f common/elf.Td common/elf.d && touch common/elf.o
# HOSTCC common/mft.o
# cc -MT common/mft.o -MMD -MP -MF common/mft.Td -Wall -Werror -std=c11 -fstack-protector-strong -O2 -g -I/home/opam/.opam/4.14/.opam-switch/build/solo5-bindings-hvt.0.6.9/include/solo5 -c common/mft.c -o common/mft.o
# mv -f common/mft.Td common/mft.d && touch common/mft.o
# HOSTCC common/block_attach.o
# cc -MT common/block_attach.o -MMD -MP -MF common/block_attach.Td -Wall -Werror -std=c11 -fstack-protector-strong -O2 -g -I/home/opam/.opam/4.14/.opam-switch/build/solo5-bindings-hvt.0.6.9/include/solo5 -c common/block_attach.c -o common/block_attach.o
# mv -f common/block_attach.Td common/block_attach.d && touch common/block_attach.o
# HOSTCC common/tap_attach.o
# cc -MT common/tap_attach.o -MMD -MP -MF common/tap_attach.Td -Wall -Werror -std=c11 -fstack-protector-strong -O2 -g -I/home/opam/.opam/4.14/.opam-switch/build/solo5-bindings-hvt.0.6.9/include/solo5 -c common/tap_attach.c -o common/tap_attach.o
# mv -f common/tap_attach.Td common/tap_attach.d && touch common/tap_attach.o
# HOSTAR common/libcommon.a
# ar rc common/libcommon.a common/elf.o common/mft.o common/block_attach.o common/tap_attach.o
# HOSTCC hvt/hvt_boot_info.o
# cc -MT hvt/hvt_boot_info.o -MMD -MP -MF hvt/hvt_boot_info.Td -Wall -Werror -std=c11 -fstack-protector-strong -O2 -g -I/home/opam/.opam/4.14/.opam-switch/build/solo5-bindings-hvt.0.6.9/include/solo5 -c hvt/hvt_boot_info.c -o hvt/hvt_boot_info.o
# mv -f hvt/hvt_boot_info.Td hvt/hvt_boot_info.d && touch hvt/hvt_boot_info.o
# HOSTCC hvt/hvt_core.o
# cc -MT hvt/hvt_core.o -MMD -MP -MF hvt/hvt_core.Td -Wall -Werror -std=c11 -fstack-protector-strong -O2 -g -I/home/opam/.opam/4.14/.opam-switch/build/solo5-bindings-hvt.0.6.9/include/solo5 -c hvt/hvt_core.c -o hvt/hvt_core.o
# mv -f hvt/hvt_core.Td hvt/hvt_core.d && touch hvt/hvt_core.o
# HOSTCC hvt/hvt_main.o
# cc -MT hvt/hvt_main.o -MMD -MP -MF hvt/hvt_main.Td -Wall -Werror -std=c11 -fstack-protector-strong -O2 -g -I/home/opam/.opam/4.14/.opam-switch/build/solo5-bindings-hvt.0.6.9/include/solo5 -c hvt/hvt_main.c -o hvt/hvt_main.o
# mv -f hvt/hvt_main.Td hvt/hvt_main.d && touch hvt/hvt_main.o
# HOSTCC hvt/hvt_cpu_x86_64.o
# cc -MT hvt/hvt_cpu_x86_64.o -MMD -MP -MF hvt/hvt_cpu_x86_64.Td -Wall -Werror -std=c11 -fstack-protector-strong -O2 -g -I/home/opam/.opam/4.14/.opam-switch/build/solo5-bindings-hvt.0.6.9/include/solo5 -c hvt/hvt_cpu_x86_64.c -o hvt/hvt_cpu_x86_64.o
# mv -f hvt/hvt_cpu_x86_64.Td hvt/hvt_cpu_x86_64.d && touch hvt/hvt_cpu_x86_64.o
# HOSTCC hvt/hvt_kvm.o
# cc -MT hvt/hvt_kvm.o -MMD -MP -MF hvt/hvt_kvm.Td -Wall -Werror -std=c11 -fstack-protector-strong -O2 -g -I/home/opam/.opam/4.14/.opam-switch/build/solo5-bindings-hvt.0.6.9/include/solo5 -c hvt/hvt_kvm.c -o hvt/hvt_kvm.o
# mv -f hvt/hvt_kvm.Td hvt/hvt_kvm.d && touch hvt/hvt_kvm.o
# HOSTCC hvt/hvt_kvm_x86_64.o
# cc -MT hvt/hvt_kvm_x86_64.o -MMD -MP -MF hvt/hvt_kvm_x86_64.Td -Wall -Werror -std=c11 -fstack-protector-strong -O2 -g -I/home/opam/.opam/4.14/.opam-switch/build/solo5-bindings-hvt.0.6.9/include/solo5 -c hvt/hvt_kvm_x86_64.c -o hvt/hvt_kvm_x86_64.o
# mv -f hvt/hvt_kvm_x86_64.Td hvt/hvt_kvm_x86_64.d && touch hvt/hvt_kvm_x86_64.o
# HOSTCC hvt/hvt_module_blk.o
# cc -MT hvt/hvt_module_blk.o -MMD -MP -MF hvt/hvt_module_blk.Td -Wall -Werror -std=c11 -fstack-protector-strong -O2 -g -I/home/opam/.opam/4.14/.opam-switch/build/solo5-bindings-hvt.0.6.9/include/solo5 -c hvt/hvt_module_blk.c -o hvt/hvt_module_blk.o
# mv -f hvt/hvt_module_blk.Td hvt/hvt_module_blk.d && touch hvt/hvt_module_blk.o
# HOSTCC hvt/hvt_module_net.o
# cc -MT hvt/hvt_module_net.o -MMD -MP -MF hvt/hvt_module_net.Td -Wall -Werror -std=c11 -fstack-protector-strong -O2 -g -I/home/opam/.opam/4.14/.opam-switch/build/solo5-bindings-hvt.0.6.9/include/solo5 -c hvt/hvt_module_net.c -o hvt/hvt_module_net.o
# mv -f hvt/hvt_module_net.Td hvt/hvt_module_net.d && touch hvt/hvt_module_net.o
# HOSTLINK hvt/solo5-hvt
# cc -Wl,-z -Wl,noexecstack hvt/hvt_boot_info.o hvt/hvt_core.o hvt/hvt_main.o hvt/hvt_cpu_x86_64.o hvt/hvt_kvm.o hvt/hvt_kvm_x86_64.o hvt/hvt_module_blk.o hvt/hvt_module_net.o common/libcommon.a  -o hvt/solo5-hvt
# HOSTCC hvt/hvt_module_gdb.o
# cc -MT hvt/hvt_module_gdb.o -MMD -MP -MF hvt/hvt_module_gdb.Td -Wall -Werror -std=c11 -fstack-protector-strong -O2 -g -I/home/opam/.opam/4.14/.opam-switch/build/solo5-bindings-hvt.0.6.9/include/solo5 -c hvt/hvt_module_gdb.c -o hvt/hvt_module_gdb.o
# mv -f hvt/hvt_module_gdb.Td hvt/hvt_module_gdb.d && touch hvt/hvt_module_gdb.o
# HOSTCC hvt/hvt_module_dumpcore.o
# cc -MT hvt/hvt_module_dumpcore.o -MMD -MP -MF hvt/hvt_module_dumpcore.Td -Wall -Werror -std=c11 -fstack-protector-strong -O2 -g -I/home/opam/.opam/4.14/.opam-switch/build/solo5-bindings-hvt.0.6.9/include/solo5 -c hvt/hvt_module_dumpcore.c -o hvt/hvt_module_dumpcore.o
# mv -f hvt/hvt_module_dumpcore.Td hvt/hvt_module_dumpcore.d && touch hvt/hvt_module_dumpcore.o
# HOSTLINK hvt/solo5-hvt-debug
# cc -Wl,-z -Wl,noexecstack hvt/hvt_boot_info.o hvt/hvt_core.o hvt/hvt_main.o hvt/hvt_cpu_x86_64.o hvt/hvt_kvm.o hvt/hvt_kvm_x86_64.o hvt/hvt_module_blk.o hvt/hvt_module_net.o hvt/hvt_module_gdb.o hvt/hvt_module_dumpcore.o common/libcommon.a  -o hvt/solo5-hvt-debug
# make[1]: Leaving directory '/home/opam/.opam/4.14/.opam-switch/build/solo5-bindings-hvt.0.6.9/tenders'
# MAKE elftool
# /usr/bin/make -C elftool  
# make[1]: Entering directory '/home/opam/.opam/4.14/.opam-switch/build/solo5-bindings-hvt.0.6.9/elftool'
# HOSTCC elftool.o
# cc -MT elftool.o -MMD -MP -MF elftool.Td -Wall -Werror -std=c11 -fstack-protector-strong -O2 -g -I/home/opam/.opam/4.14/.opam-switch/build/solo5-bindings-hvt.0.6.9/include/solo5 -c elftool.c -o elftool.o
# mv -f elftool.Td elftool.d && touch elftool.o
# HOSTLINK solo5-elftool
# cc  elftool.o  -o solo5-elftool
# make[1]: Leaving directory '/home/opam/.opam/4.14/.opam-switch/build/solo5-bindings-hvt.0.6.9/elftool'
# MAKE tests
# /usr/bin/make -C tests  
# make[1]: Entering directory '/home/opam/.opam/4.14/.opam-switch/build/solo5-bindings-hvt.0.6.9/tests'
# MAKE test_blk
# /usr/bin/make -C test_blk  
# make[2]: Entering directory '/home/opam/.opam/4.14/.opam-switch/build/solo5-bindings-hvt.0.6.9/tests/test_blk'
# CC test_blk.c
# cc -std=c11 -Wall -Wextra -Werror -O2 -g -ffreestanding -fstack-protector-strong -nostdinc -mstack-protector-guard=global -isystem /home/opam/.opam/4.14/.opam-switch/build/solo5-bindings-hvt.0.6.9/include/crt -I/home/opam/.opam/4.14/.opam-switch/build/solo5-bindings-hvt.0.6.9/include/solo5 -c test_blk.c -o test_blk.o
# ELFTOOL manifest.json
# /home/opam/.opam/4.14/.opam-switch/build/solo5-bindings-hvt.0.6.9/elftool/solo5-elftool gen-manifest manifest.json manifest.c
# CC manifest.c
# cc -std=c11 -Wall -Wextra -Werror -O2 -g -ffreestanding -fstack-protector-strong -nostdinc -mstack-protector-guard=global -isystem /home/opam/.opam/4.14/.opam-switch/build/solo5-bindings-hvt.0.6.9/include/crt -I/home/opam/.opam/4.14/.opam-switch/build/solo5-bindings-hvt.0.6.9/include/solo5 -c manifest.c -o manifest.o
# LD test_blk.hvt
# ld -nostdlib -z max-page-size=0x1000 -static  -T /home/opam/.opam/4.14/.opam-switch/build/solo5-bindings-hvt.0.6.9/bindings/hvt/solo5_hvt.lds /home/opam/.opam/4.14/.opam-switch/build/solo5-bindings-hvt.0.6.9/bindings/hvt/solo5_hvt.o test_blk.o manifest.o -o test_blk.hvt
# ld: warning: /home/opam/.opam/4.14/.opam-switch/build/solo5-bindings-hvt.0.6.9/bindings/hvt/solo5_hvt.o: requires executable stack (because the .note.GNU-stack section is executable)
# make[2]: Leaving directory '/home/opam/.opam/4.14/.opam-switch/build/solo5-bindings-hvt.0.6.9/tests/test_blk'
# MAKE test_dumpcore
# /usr/bin/make -C test_dumpcore  
# make[2]: Entering directory '/home/opam/.opam/4.14/.opam-switch/build/solo5-bindings-hvt.0.6.9/tests/test_dumpcore'
# CC test_dumpcore.c
# cc -std=c11 -Wall -Wextra -Werror -O2 -g -ffreestanding -fstack-protector-strong -nostdinc -mstack-protector-guard=global -isystem /home/opam/.opam/4.14/.opam-switch/build/solo5-bindings-hvt.0.6.9/include/crt -I/home/opam/.opam/4.14/.opam-switch/build/solo5-bindings-hvt.0.6.9/include/solo5 -c test_dumpcore.c -o test_dumpcore.o
# ELFTOOL manifest.json
# /home/opam/.opam/4.14/.opam-switch/build/solo5-bindings-hvt.0.6.9/elftool/solo5-elftool gen-manifest manifest.json manifest.c
# CC manifest.c
# cc -std=c11 -Wall -Wextra -Werror -O2 -g -ffreestanding -fstack-protector-strong -nostdinc -mstack-protector-guard=global -isystem /home/opam/.opam/4.14/.opam-switch/build/solo5-bindings-hvt.0.6.9/include/crt -I/home/opam/.opam/4.14/.opam-switch/build/solo5-bindings-hvt.0.6.9/include/solo5 -c manifest.c -o manifest.o
# LD test_dumpcore.hvt
# ld -nostdlib -z max-page-size=0x1000 -static  -T /home/opam/.opam/4.14/.opam-switch/build/solo5-bindings-hvt.0.6.9/bindings/hvt/solo5_hvt.lds /home/opam/.opam/4.14/.opam-switch/build/solo5-bindings-hvt.0.6.9/bindings/hvt/solo5_hvt.o test_dumpcore.o manifest.o -o test_dumpcore.hvt
# ld: warning: /home/opam/.opam/4.14/.opam-switch/build/solo5-bindings-hvt.0.6.9/bindings/hvt/solo5_hvt.o: requires executable stack (because the .note.GNU-stack section is executable)
# make[2]: Leaving directory '/home/opam/.opam/4.14/.opam-switch/build/solo5-bindings-hvt.0.6.9/tests/test_dumpcore'
# MAKE test_exception
# /usr/bin/make -C test_exception  
# make[2]: Entering directory '/home/opam/.opam/4.14/.opam-switch/build/solo5-bindings-hvt.0.6.9/tests/test_exception'
# CC test_exception.c
# cc -std=c11 -Wall -Wextra -Werror -O2 -g -ffreestanding -fstack-protector-strong -nostdinc -mstack-protector-guard=global -isystem /home/opam/.opam/4.14/.opam-switch/build/solo5-bindings-hvt.0.6.9/include/crt -I/home/opam/.opam/4.14/.opam-switch/build/solo5-bindings-hvt.0.6.9/include/solo5 -c test_exception.c -o test_exception.o
# ELFTOOL manifest.json
# /home/opam/.opam/4.14/.opam-switch/build/solo5-bindings-hvt.0.6.9/elftool/solo5-elftool gen-manifest manifest.json manifest.c
# CC manifest.c
# cc -std=c11 -Wall -Wextra -Werror -O2 -g -ffreestanding -fstack-protector-strong -nostdinc -mstack-protector-guard=global -isystem /home/opam/.opam/4.14/.opam-switch/build/solo5-bindings-hvt.0.6.9/include/crt -I/home/opam/.opam/4.14/.opam-switch/build/solo5-bindings-hvt.0.6.9/include/solo5 -c manifest.c -o manifest.o
# LD test_exception.hvt
# ld -nostdlib -z max-page-size=0x1000 -static  -T /home/opam/.opam/4.14/.opam-switch/build/solo5-bindings-hvt.0.6.9/bindings/hvt/solo5_hvt.lds /home/opam/.opam/4.14/.opam-switch/build/solo5-bindings-hvt.0.6.9/bindings/hvt/solo5_hvt.o test_exception.o manifest.o -o test_exception.hvt
# ld: warning: /home/opam/.opam/4.14/.opam-switch/build/solo5-bindings-hvt.0.6.9/bindings/hvt/solo5_hvt.o: requires executable stack (because the .note.GNU-stack section is executable)
# make[2]: Leaving directory '/home/opam/.opam/4.14/.opam-switch/build/solo5-bindings-hvt.0.6.9/tests/test_exception'
# MAKE test_fpu
# /usr/bin/make -C test_fpu  
# make[2]: Entering directory '/home/opam/.opam/4.14/.opam-switch/build/solo5-bindings-hvt.0.6.9/tests/test_fpu'
# CC test_fpu.c
# cc -std=c11 -Wall -Wextra -Werror -O2 -g -ffreestanding -fstack-protector-strong -nostdinc -mstack-protector-guard=global -isystem /home/opam/.opam/4.14/.opam-switch/build/solo5-bindings-hvt.0.6.9/include/crt -I/home/opam/.opam/4.14/.opam-switch/build/solo5-bindings-hvt.0.6.9/include/solo5 -c test_fpu.c -o test_fpu.o
# ELFTOOL manifest.json
# /home/opam/.opam/4.14/.opam-switch/build/solo5-bindings-hvt.0.6.9/elftool/solo5-elftool gen-manifest manifest.json manifest.c
# CC manifest.c
# cc -std=c11 -Wall -Wextra -Werror -O2 -g -ffreestanding -fstack-protector-strong -nostdinc -mstack-protector-guard=global -isystem /home/opam/.opam/4.14/.opam-switch/build/solo5-bindings-hvt.0.6.9/include/crt -I/home/opam/.opam/4.14/.opam-switch/build/solo5-bindings-hvt.0.6.9/include/solo5 -c manifest.c -o manifest.o
# LD test_fpu.hvt
# ld -nostdlib -z max-page-size=0x1000 -static  -T /home/opam/.opam/4.14/.opam-switch/build/solo5-bindings-hvt.0.6.9/bindings/hvt/solo5_hvt.lds /home/opam/.opam/4.14/.opam-switch/build/solo5-bindings-hvt.0.6.9/bindings/hvt/solo5_hvt.o test_fpu.o manifest.o -o test_fpu.hvt
# ld: warning: /home/opam/.opam/4.14/.opam-switch/build/solo5-bindings-hvt.0.6.9/bindings/hvt/solo5_hvt.o: requires executable stack (because the .note.GNU-stack section is executable)
# make[2]: Leaving directory '/home/opam/.opam/4.14/.opam-switch/build/solo5-bindings-hvt.0.6.9/tests/test_fpu'
# MAKE test_globals
# /usr/bin/make -C test_globals  
# make[2]: Entering directory '/home/opam/.opam/4.14/.opam-switch/build/solo5-bindings-hvt.0.6.9/tests/test_globals'
# CC test_globals.c
# cc -std=c11 -Wall -Wextra -Werror -O2 -g -ffreestanding -fstack-protector-strong -nostdinc -mstack-protector-guard=global -isystem /home/opam/.opam/4.14/.opam-switch/build/solo5-bindings-hvt.0.6.9/include/crt -I/home/opam/.opam/4.14/.opam-switch/build/solo5-bindings-hvt.0.6.9/include/solo5 -c test_globals.c -o test_globals.o
# ELFTOOL manifest.json
# /home/opam/.opam/4.14/.opam-switch/build/solo5-bindings-hvt.0.6.9/elftool/solo5-elftool gen-manifest manifest.json manifest.c
# CC manifest.c
# cc -std=c11 -Wall -Wextra -Werror -O2 -g -ffreestanding -fstack-protector-strong -nostdinc -mstack-protector-guard=global -isystem /home/opam/.opam/4.14/.opam-switch/build/solo5-bindings-hvt.0.6.9/include/crt -I/home/opam/.opam/4.14/.opam-switch/build/solo5-bindings-hvt.0.6.9/include/solo5 -c manifest.c -o manifest.o
# LD test_globals.hvt
# ld -nostdlib -z max-page-size=0x1000 -static  -T /home/opam/.opam/4.14/.opam-switch/build/solo5-bindings-hvt.0.6.9/bindings/hvt/solo5_hvt.lds /home/opam/.opam/4.14/.opam-switch/build/solo5-bindings-hvt.0.6.9/bindings/hvt/solo5_hvt.o test_globals.o manifest.o -o test_globals.hvt
# ld: warning: /home/opam/.opam/4.14/.opam-switch/build/solo5-bindings-hvt.0.6.9/bindings/hvt/solo5_hvt.o: requires executable stack (because the .note.GNU-stack section is executable)
# make[2]: Leaving directory '/home/opam/.opam/4.14/.opam-switch/build/solo5-bindings-hvt.0.6.9/tests/test_globals'
# MAKE test_hello
# /usr/bin/make -C test_hello  
# make[2]: Entering directory '/home/opam/.opam/4.14/.opam-switch/build/solo5-bindings-hvt.0.6.9/tests/test_hello'
# CC test_hello.c
# cc -std=c11 -Wall -Wextra -Werror -O2 -g -ffreestanding -fstack-protector-strong -nostdinc -mstack-protector-guard=global -isystem /home/opam/.opam/4.14/.opam-switch/build/solo5-bindings-hvt.0.6.9/include/crt -I/home/opam/.opam/4.14/.opam-switch/build/solo5-bindings-hvt.0.6.9/include/solo5 -c test_hello.c -o test_hello.o
# ELFTOOL manifest.json
# /home/opam/.opam/4.14/.opam-switch/build/solo5-bindings-hvt.0.6.9/elftool/solo5-elftool gen-manifest manifest.json manifest.c
# CC manifest.c
# cc -std=c11 -Wall -Wextra -Werror -O2 -g -ffreestanding -fstack-protector-strong -nostdinc -mstack-protector-guard=global -isystem /home/opam/.opam/4.14/.opam-switch/build/solo5-bindings-hvt.0.6.9/include/crt -I/home/opam/.opam/4.14/.opam-switch/build/solo5-bindings-hvt.0.6.9/include/solo5 -c manifest.c -o manifest.o
# LD test_hello.hvt
# ld -nostdlib -z max-page-size=0x1000 -static  -T /home/opam/.opam/4.14/.opam-switch/build/solo5-bindings-hvt.0.6.9/bindings/hvt/solo5_hvt.lds /home/opam/.opam/4.14/.opam-switch/build/solo5-bindings-hvt.0.6.9/bindings/hvt/solo5_hvt.o test_hello.o manifest.o -o test_hello.hvt
# ld: warning: /home/opam/.opam/4.14/.opam-switch/build/solo5-bindings-hvt.0.6.9/bindings/hvt/solo5_hvt.o: requires executable stack (because the .note.GNU-stack section is executable)
# make[2]: Leaving directory '/home/opam/.opam/4.14/.opam-switch/build/solo5-bindings-hvt.0.6.9/tests/test_hello'
# MAKE test_mft_maxdevices
# /usr/bin/make -C test_mft_maxdevices  
# make[2]: Entering directory '/home/opam/.opam/4.14/.opam-switch/build/solo5-bindings-hvt.0.6.9/tests/test_mft_maxdevices'
# CC test_mft_maxdevices.c
# cc -std=c11 -Wall -Wextra -Werror -O2 -g -ffreestanding -fstack-protector-strong -nostdinc -mstack-protector-guard=global -isystem /home/opam/.opam/4.14/.opam-switch/build/solo5-bindings-hvt.0.6.9/include/crt -I/home/opam/.opam/4.14/.opam-switch/build/solo5-bindings-hvt.0.6.9/include/solo5 -c test_mft_maxdevices.c -o test_mft_maxdevices.o
# ELFTOOL manifest.json
# /home/opam/.opam/4.14/.opam-switch/build/solo5-bindings-hvt.0.6.9/elftool/solo5-elftool gen-manifest manifest.json manifest.c
# CC manifest.c
# cc -std=c11 -Wall -Wextra -Werror -O2 -g -ffreestanding -fstack-protector-strong -nostdinc -mstack-protector-guard=global -isystem /home/opam/.opam/4.14/.opam-switch/build/solo5-bindings-hvt.0.6.9/include/crt -I/home/opam/.opam/4.14/.opam-switch/build/solo5-bindings-hvt.0.6.9/include/solo5 -c manifest.c -o manifest.o
# LD test_mft_maxdevices.hvt
# ld -nostdlib -z max-page-size=0x1000 -static  -T /home/opam/.opam/4.14/.opam-switch/build/solo5-bindings-hvt.0.6.9/bindings/hvt/solo5_hvt.lds /home/opam/.opam/4.14/.opam-switch/build/solo5-bindings-hvt.0.6.9/bindings/hvt/solo5_hvt.o test_mft_maxdevices.o manifest.o -o test_mft_maxdevices.hvt
# ld: warning: /home/opam/.opam/4.14/.opam-switch/build/solo5-bindings-hvt.0.6.9/bindings/hvt/solo5_hvt.o: requires executable stack (because the .note.GNU-stack section is executable)
# make[2]: Leaving directory '/home/opam/.opam/4.14/.opam-switch/build/solo5-bindings-hvt.0.6.9/tests/test_mft_maxdevices'
# MAKE test_net
# /usr/bin/make -C test_net  
# make[2]: Entering directory '/home/opam/.opam/4.14/.opam-switch/build/solo5-bindings-hvt.0.6.9/tests/test_net'
# CC test_net.c
# cc -std=c11 -Wall -Wextra -Werror -O2 -g -ffreestanding -fstack-protector-strong -nostdinc -mstack-protector-guard=global -isystem /home/opam/.opam/4.14/.opam-switch/build/solo5-bindings-hvt.0.6.9/include/crt -I/home/opam/.opam/4.14/.opam-switch/build/solo5-bindings-hvt.0.6.9/include/solo5 -c test_net.c -o test_net.o
# ELFTOOL manifest.json
# /home/opam/.opam/4.14/.opam-switch/build/solo5-bindings-hvt.0.6.9/elftool/solo5-elftool gen-manifest manifest.json manifest.c
# CC manifest.c
# cc -std=c11 -Wall -Wextra -Werror -O2 -g -ffreestanding -fstack-protector-strong -nostdinc -mstack-protector-guard=global -isystem /home/opam/.opam/4.14/.opam-switch/build/solo5-bindings-hvt.0.6.9/include/crt -I/home/opam/.opam/4.14/.opam-switch/build/solo5-bindings-hvt.0.6.9/include/solo5 -c manifest.c -o manifest.o
# LD test_net.hvt
# ld -nostdlib -z max-page-size=0x1000 -static  -T /home/opam/.opam/4.14/.opam-switch/build/solo5-bindings-hvt.0.6.9/bindings/hvt/solo5_hvt.lds /home/opam/.opam/4.14/.opam-switch/build/solo5-bindings-hvt.0.6.9/bindings/hvt/solo5_hvt.o test_net.o manifest.o -o test_net.hvt
# ld: warning: /home/opam/.opam/4.14/.opam-switch/build/solo5-bindings-hvt.0.6.9/bindings/hvt/solo5_hvt.o: requires executable stack (because the .note.GNU-stack section is executable)
# make[2]: Leaving directory '/home/opam/.opam/4.14/.opam-switch/build/solo5-bindings-hvt.0.6.9/tests/test_net'
# MAKE test_net_2if
# /usr/bin/make -C test_net_2if  
# make[2]: Entering directory '/home/opam/.opam/4.14/.opam-switch/build/solo5-bindings-hvt.0.6.9/tests/test_net_2if'
# CC test_net_2if.c
# cc -std=c11 -Wall -Wextra -Werror -O2 -g -ffreestanding -fstack-protector-strong -nostdinc -mstack-protector-guard=global -isystem /home/opam/.opam/4.14/.opam-switch/build/solo5-bindings-hvt.0.6.9/include/crt -I/home/opam/.opam/4.14/.opam-switch/build/solo5-bindings-hvt.0.6.9/include/solo5 -c test_net_2if.c -o test_net_2if.o
# ELFTOOL manifest.json
# /home/opam/.opam/4.14/.opam-switch/build/solo5-bindings-hvt.0.6.9/elftool/solo5-elftool gen-manifest manifest.json manifest.c
# CC manifest.c
# cc -std=c11 -Wall -Wextra -Werror -O2 -g -ffreestanding -fstack-protector-strong -nostdinc -mstack-protector-guard=global -isystem /home/opam/.opam/4.14/.opam-switch/build/solo5-bindings-hvt.0.6.9/include/crt -I/home/opam/.opam/4.14/.opam-switch/build/solo5-bindings-hvt.0.6.9/include/solo5 -c manifest.c -o manifest.o
# LD test_net_2if.hvt
# ld -nostdlib -z max-page-size=0x1000 -static  -T /home/opam/.opam/4.14/.opam-switch/build/solo5-bindings-hvt.0.6.9/bindings/hvt/solo5_hvt.lds /home/opam/.opam/4.14/.opam-switch/build/solo5-bindings-hvt.0.6.9/bindings/hvt/solo5_hvt.o test_net_2if.o manifest.o -o test_net_2if.hvt
# ld: warning: /home/opam/.opam/4.14/.opam-switch/build/solo5-bindings-hvt.0.6.9/bindings/hvt/solo5_hvt.o: requires executable stack (because the .note.GNU-stack section is executable)
# make[2]: Leaving directory '/home/opam/.opam/4.14/.opam-switch/build/solo5-bindings-hvt.0.6.9/tests/test_net_2if'
# MAKE test_notls
# /usr/bin/make -C test_notls  
# make[2]: Entering directory '/home/opam/.opam/4.14/.opam-switch/build/solo5-bindings-hvt.0.6.9/tests/test_notls'
# CC test_notls.c
# cc -std=c11 -Wall -Wextra -Werror -O2 -g -ffreestanding -fstack-protector-strong -nostdinc -mstack-protector-guard=global -isystem /home/opam/.opam/4.14/.opam-switch/build/solo5-bindings-hvt.0.6.9/include/crt -I/home/opam/.opam/4.14/.opam-switch/build/solo5-bindings-hvt.0.6.9/include/solo5 -c test_notls.c -o test_notls.o
# ELFTOOL manifest.json
# /home/opam/.opam/4.14/.opam-switch/build/solo5-bindings-hvt.0.6.9/elftool/solo5-elftool gen-manifest manifest.json manifest.c
# CC manifest.c
# cc -std=c11 -Wall -Wextra -Werror -O2 -g -ffreestanding -fstack-protector-strong -nostdinc -mstack-protector-guard=global -isystem /home/opam/.opam/4.14/.opam-switch/build/solo5-bindings-hvt.0.6.9/include/crt -I/home/opam/.opam/4.14/.opam-switch/build/solo5-bindings-hvt.0.6.9/include/solo5 -c manifest.c -o manifest.o
# LD test_notls.hvt
# ld -nostdlib -z max-page-size=0x1000 -static  -T /home/opam/.opam/4.14/.opam-switch/build/solo5-bindings-hvt.0.6.9/bindings/hvt/solo5_hvt.lds /home/opam/.opam/4.14/.opam-switch/build/solo5-bindings-hvt.0.6.9/bindings/hvt/solo5_hvt.o test_notls.o manifest.o -o test_notls.hvt
# ld: warning: /home/opam/.opam/4.14/.opam-switch/build/solo5-bindings-hvt.0.6.9/bindings/hvt/solo5_hvt.o: requires executable stack (because the .note.GNU-stack section is executable)
# make[2]: Leaving directory '/home/opam/.opam/4.14/.opam-switch/build/solo5-bindings-hvt.0.6.9/tests/test_notls'
# MAKE test_quiet
# /usr/bin/make -C test_quiet  
# make[2]: Entering directory '/home/opam/.opam/4.14/.opam-switch/build/solo5-bindings-hvt.0.6.9/tests/test_quiet'
# CC test_quiet.c
# cc -std=c11 -Wall -Wextra -Werror -O2 -g -ffreestanding -fstack-protector-strong -nostdinc -mstack-protector-guard=global -isystem /home/opam/.opam/4.14/.opam-switch/build/solo5-bindings-hvt.0.6.9/include/crt -I/home/opam/.opam/4.14/.opam-switch/build/solo5-bindings-hvt.0.6.9/include/solo5 -c test_quiet.c -o test_quiet.o
# ELFTOOL manifest.json
# /home/opam/.opam/4.14/.opam-switch/build/solo5-bindings-hvt.0.6.9/elftool/solo5-elftool gen-manifest manifest.json manifest.c
# CC manifest.c
# cc -std=c11 -Wall -Wextra -Werror -O2 -g -ffreestanding -fstack-protector-strong -nostdinc -mstack-protector-guard=global -isystem /home/opam/.opam/4.14/.opam-switch/build/solo5-bindings-hvt.0.6.9/include/crt -I/home/opam/.opam/4.14/.opam-switch/build/solo5-bindings-hvt.0.6.9/include/solo5 -c manifest.c -o manifest.o
# LD test_quiet.hvt
# ld -nostdlib -z max-page-size=0x1000 -static  -T /home/opam/.opam/4.14/.opam-switch/build/solo5-bindings-hvt.0.6.9/bindings/hvt/solo5_hvt.lds /home/opam/.opam/4.14/.opam-switch/build/solo5-bindings-hvt.0.6.9/bindings/hvt/solo5_hvt.o test_quiet.o manifest.o -o test_quiet.hvt
# ld: warning: /home/opam/.opam/4.14/.opam-switch/build/solo5-bindings-hvt.0.6.9/bindings/hvt/solo5_hvt.o: requires executable stack (because the .note.GNU-stack section is executable)
# make[2]: Leaving directory '/home/opam/.opam/4.14/.opam-switch/build/solo5-bindings-hvt.0.6.9/tests/test_quiet'
# MAKE test_seccomp
# /usr/bin/make -C test_seccomp  
# make[2]: Entering directory '/home/opam/.opam/4.14/.opam-switch/build/solo5-bindings-hvt.0.6.9/tests/test_seccomp'
# make[2]: Nothing to be done for 'all'.
# make[2]: Leaving directory '/home/opam/.opam/4.14/.opam-switch/build/solo5-bindings-hvt.0.6.9/tests/test_seccomp'
# MAKE test_ssp
# /usr/bin/make -C test_ssp  
# make[2]: Entering directory '/home/opam/.opam/4.14/.opam-switch/build/solo5-bindings-hvt.0.6.9/tests/test_ssp'
# CC test_ssp.c
# cc -std=c11 -Wall -Wextra -Werror -O2 -g -ffreestanding -fstack-protector-strong -nostdinc -mstack-protector-guard=global -isystem /home/opam/.opam/4.14/.opam-switch/build/solo5-bindings-hvt.0.6.9/include/crt -I/home/opam/.opam/4.14/.opam-switch/build/solo5-bindings-hvt.0.6.9/include/solo5 -c test_ssp.c -o test_ssp.o
# ELFTOOL manifest.json
# /home/opam/.opam/4.14/.opam-switch/build/solo5-bindings-hvt.0.6.9/elftool/solo5-elftool gen-manifest manifest.json manifest.c
# CC manifest.c
# cc -std=c11 -Wall -Wextra -Werror -O2 -g -ffreestanding -fstack-protector-strong -nostdinc -mstack-protector-guard=global -isystem /home/opam/.opam/4.14/.opam-switch/build/solo5-bindings-hvt.0.6.9/include/crt -I/home/opam/.opam/4.14/.opam-switch/build/solo5-bindings-hvt.0.6.9/include/solo5 -c manifest.c -o manifest.o
# LD test_ssp.hvt
# ld -nostdlib -z max-page-size=0x1000 -static  -T /home/opam/.opam/4.14/.opam-switch/build/solo5-bindings-hvt.0.6.9/bindings/hvt/solo5_hvt.lds /home/opam/.opam/4.14/.opam-switch/build/solo5-bindings-hvt.0.6.9/bindings/hvt/solo5_hvt.o test_ssp.o manifest.o -o test_ssp.hvt
# ld: warning: /home/opam/.opam/4.14/.opam-switch/build/solo5-bindings-hvt.0.6.9/bindings/hvt/solo5_hvt.o: requires executable stack (because the .note.GNU-stack section is executable)
# make[2]: Leaving directory '/home/opam/.opam/4.14/.opam-switch/build/solo5-bindings-hvt.0.6.9/tests/test_ssp'
# MAKE test_time
# /usr/bin/make -C test_time  
# make[2]: Entering directory '/home/opam/.opam/4.14/.opam-switch/build/solo5-bindings-hvt.0.6.9/tests/test_time'
# CC test_time.c
# cc -std=c11 -Wall -Wextra -Werror -O2 -g -ffreestanding -fstack-protector-strong -nostdinc -mstack-protector-guard=global -isystem /home/opam/.opam/4.14/.opam-switch/build/solo5-bindings-hvt.0.6.9/include/crt -I/home/opam/.opam/4.14/.opam-switch/build/solo5-bindings-hvt.0.6.9/include/solo5 -c test_time.c -o test_time.o
# ELFTOOL manifest.json
# /home/opam/.opam/4.14/.opam-switch/build/solo5-bindings-hvt.0.6.9/elftool/solo5-elftool gen-manifest manifest.json manifest.c
# CC manifest.c
# cc -std=c11 -Wall -Wextra -Werror -O2 -g -ffreestanding -fstack-protector-strong -nostdinc -mstack-protector-guard=global -isystem /home/opam/.opam/4.14/.opam-switch/build/solo5-bindings-hvt.0.6.9/include/crt -I/home/opam/.opam/4.14/.opam-switch/build/solo5-bindings-hvt.0.6.9/include/solo5 -c manifest.c -o manifest.o
# LD test_time.hvt
# ld -nostdlib -z max-page-size=0x1000 -static  -T /home/opam/.opam/4.14/.opam-switch/build/solo5-bindings-hvt.0.6.9/bindings/hvt/solo5_hvt.lds /home/opam/.opam/4.14/.opam-switch/build/solo5-bindings-hvt.0.6.9/bindings/hvt/solo5_hvt.o test_time.o manifest.o -o test_time.hvt
# ld: warning: /home/opam/.opam/4.14/.opam-switch/build/solo5-bindings-hvt.0.6.9/bindings/hvt/solo5_hvt.o: requires executable stack (because the .note.GNU-stack section is executable)
# make[2]: Leaving directory '/home/opam/.opam/4.14/.opam-switch/build/solo5-bindings-hvt.0.6.9/tests/test_time'
# MAKE test_tls
# /usr/bin/make -C test_tls  
# make[2]: Entering directory '/home/opam/.opam/4.14/.opam-switch/build/solo5-bindings-hvt.0.6.9/tests/test_tls'
# CC test_tls.c
# cc -std=c11 -Wall -Wextra -Werror -O2 -g -ffreestanding -fstack-protector-strong -nostdinc -mstack-protector-guard=global -isystem /home/opam/.opam/4.14/.opam-switch/build/solo5-bindings-hvt.0.6.9/include/crt -I/home/opam/.opam/4.14/.opam-switch/build/solo5-bindings-hvt.0.6.9/include/solo5 -c test_tls.c -o test_tls.o
# ELFTOOL manifest.json
# /home/opam/.opam/4.14/.opam-switch/build/solo5-bindings-hvt.0.6.9/elftool/solo5-elftool gen-manifest manifest.json manifest.c
# CC manifest.c
# cc -std=c11 -Wall -Wextra -Werror -O2 -g -ffreestanding -fstack-protector-strong -nostdinc -mstack-protector-guard=global -isystem /home/opam/.opam/4.14/.opam-switch/build/solo5-bindings-hvt.0.6.9/include/crt -I/home/opam/.opam/4.14/.opam-switch/build/solo5-bindings-hvt.0.6.9/include/solo5 -c manifest.c -o manifest.o
# LD test_tls.hvt
# ld -nostdlib -z max-page-size=0x1000 -static  -T /home/opam/.opam/4.14/.opam-switch/build/solo5-bindings-hvt.0.6.9/bindings/hvt/solo5_hvt.lds /home/opam/.opam/4.14/.opam-switch/build/solo5-bindings-hvt.0.6.9/bindings/hvt/solo5_hvt.o test_tls.o manifest.o -o test_tls.hvt
# ld: warning: /home/opam/.opam/4.14/.opam-switch/build/solo5-bindings-hvt.0.6.9/bindings/hvt/solo5_hvt.o: requires executable stack (because the .note.GNU-stack section is executable)
# make[2]: Leaving directory '/home/opam/.opam/4.14/.opam-switch/build/solo5-bindings-hvt.0.6.9/tests/test_tls'
# MAKE test_wnox
# /usr/bin/make -C test_wnox  
# make[2]: Entering directory '/home/opam/.opam/4.14/.opam-switch/build/solo5-bindings-hvt.0.6.9/tests/test_wnox'
# CC test_wnox.c
# cc -std=c11 -Wall -Wextra -Werror -O2 -g -ffreestanding -fstack-protector-strong -nostdinc -mstack-protector-guard=global -isystem /home/opam/.opam/4.14/.opam-switch/build/solo5-bindings-hvt.0.6.9/include/crt -I/home/opam/.opam/4.14/.opam-switch/build/solo5-bindings-hvt.0.6.9/include/solo5 -c test_wnox.c -o test_wnox.o
# /tmp/ccNWt9pv.s: Assembler messages:
# /tmp/ccNWt9pv.s:726: Warning: ignoring changed section attributes for .data
# /tmp/ccNWt9pv.s:733: Warning: dwarf line number information for .data ignored
# /tmp/ccNWt9pv.s:735: Warning: dwarf line number information for .data ignored
# /tmp/ccNWt9pv.s:736: Warning: dwarf line number information for .data ignored
# ELFTOOL manifest.json
# /home/opam/.opam/4.14/.opam-switch/build/solo5-bindings-hvt.0.6.9/elftool/solo5-elftool gen-manifest manifest.json manifest.c
# CC manifest.c
# cc -std=c11 -Wall -Wextra -Werror -O2 -g -ffreestanding -fstack-protector-strong -nostdinc -mstack-protector-guard=global -isystem /home/opam/.opam/4.14/.opam-switch/build/solo5-bindings-hvt.0.6.9/include/crt -I/home/opam/.opam/4.14/.opam-switch/build/solo5-bindings-hvt.0.6.9/include/solo5 -c manifest.c -o manifest.o
# LD test_wnox.hvt
# ld -nostdlib -z max-page-size=0x1000 -static  -T /home/opam/.opam/4.14/.opam-switch/build/solo5-bindings-hvt.0.6.9/bindings/hvt/solo5_hvt.lds /home/opam/.opam/4.14/.opam-switch/build/solo5-bindings-hvt.0.6.9/bindings/hvt/solo5_hvt.o test_wnox.o manifest.o -o test_wnox.hvt
# ld: warning: /home/opam/.opam/4.14/.opam-switch/build/solo5-bindings-hvt.0.6.9/bindings/hvt/solo5_hvt.o: requires executable stack (because the .note.GNU-stack section is executable)
# make[2]: Leaving directory '/home/opam/.opam/4.14/.opam-switch/build/solo5-bindings-hvt.0.6.9/tests/test_wnox'
# MAKE test_xnow
# /usr/bin/make -C test_xnow  
# make[2]: Entering directory '/home/opam/.opam/4.14/.opam-switch/build/solo5-bindings-hvt.0.6.9/tests/test_xnow'
# CC test_xnow.c
# cc -std=c11 -Wall -Wextra -Werror -O2 -g -ffreestanding -fstack-protector-strong -nostdinc -mstack-protector-guard=global -isystem /home/opam/.opam/4.14/.opam-switch/build/solo5-bindings-hvt.0.6.9/include/crt -I/home/opam/.opam/4.14/.opam-switch/build/solo5-bindings-hvt.0.6.9/include/solo5 -c test_xnow.c -o test_xnow.o
# ELFTOOL manifest.json
# /home/opam/.opam/4.14/.opam-switch/build/solo5-bindings-hvt.0.6.9/elftool/solo5-elftool gen-manifest manifest.json manifest.c
# CC manifest.c
# cc -std=c11 -Wall -Wextra -Werror -O2 -g -ffreestanding -fstack-protector-strong -nostdinc -mstack-protector-guard=global -isystem /home/opam/.opam/4.14/.opam-switch/build/solo5-bindings-hvt.0.6.9/include/crt -I/home/opam/.opam/4.14/.opam-switch/build/solo5-bindings-hvt.0.6.9/include/solo5 -c manifest.c -o manifest.o
# LD test_xnow.hvt
# ld -nostdlib -z max-page-size=0x1000 -static  -T /home/opam/.opam/4.14/.opam-switch/build/solo5-bindings-hvt.0.6.9/bindings/hvt/solo5_hvt.lds /home/opam/.opam/4.14/.opam-switch/build/solo5-bindings-hvt.0.6.9/bindings/hvt/solo5_hvt.o test_xnow.o manifest.o -o test_xnow.hvt
# ld: warning: /home/opam/.opam/4.14/.opam-switch/build/solo5-bindings-hvt.0.6.9/bindings/hvt/solo5_hvt.o: requires executable stack (because the .note.GNU-stack section is executable)
# make[2]: Leaving directory '/home/opam/.opam/4.14/.opam-switch/build/solo5-bindings-hvt.0.6.9/tests/test_xnow'
# MAKE test_zeropage
# /usr/bin/make -C test_zeropage  
# make[2]: Entering directory '/home/opam/.opam/4.14/.opam-switch/build/solo5-bindings-hvt.0.6.9/tests/test_zeropage'
# CC test_zeropage.c
# cc -std=c11 -Wall -Wextra -Werror -O2 -g -ffreestanding -fstack-protector-strong -nostdinc -mstack-protector-guard=global -isystem /home/opam/.opam/4.14/.opam-switch/build/solo5-bindings-hvt.0.6.9/include/crt -I/home/opam/.opam/4.14/.opam-switch/build/solo5-bindings-hvt.0.6.9/include/solo5 -c test_zeropage.c -o test_zeropage.o
# test_zeropage.c: In function 'solo5_app_main':
# test_zeropage.c:39:5: error: array subscript 0 is outside array bounds of 'uint64_t[0]' {aka 'long unsigned int[]'} [-Werror=array-bounds]
#    39 |     *addr_invalid = 1;
#       |     ^~~~~~~~~~~~~
# cc1: all warnings being treated as errors
# make[2]: *** [../Makefile.tests:51: test_zeropage.o] Error 1
# make[2]: Leaving directory '/home/opam/.opam/4.14/.opam-switch/build/solo5-bindings-hvt.0.6.9/tests/test_zeropage'
# make[1]: *** [GNUmakefile:33: test_zeropage] Error 2
# make[1]: Leaving directory '/home/opam/.opam/4.14/.opam-switch/build/solo5-bindings-hvt.0.6.9/tests'
# make: *** [GNUmakefile:70: tests] Error 2



<><> Error report <><><><><><><><><><><><><><><><><><><><><><><><><><><><><><><>
+- The following actions were aborted
| - install mirage-solo5       0.6.2
| - install ocaml-freestanding 0.6.7
+- 
+- The following actions failed
| - build solo5-bindings-hvt 0.6.9
+- 
+- The following changes have been performed (the rest was aborted)
| - install base-bytes        base
| - install bheap             1.0.0
| - install cmdliner          1.2.0
| - install conf-libseccomp   1
| - install conf-pkg-config   2
| - install cppo              1.6.9
| - install csexp             1.5.2
| - install cstruct           6.2.0
| - install domain-name       0.4.0
| - install dune-configurator 3.13.0
| - install fmt               0.9.0
| - install functoria-runtime 4.4.1
| - install ipaddr            5.5.0
| - install logs              0.7.0
| - install lwt               5.7.0
| - install macaddr           5.5.0
| - install metrics           0.4.1
| - install mirage-runtime    4.4.1
| - install obuild            0.1.11
| - install ocaml-src         4.14.1
| - install ocamlbuild        0.14.3
| - install ocplib-endian     1.2
| - install topkg             1.0.7
+- 
# Run eval $(opam env) to update the current shell environment

The former state can be restored with:
    /usr/bin/opam switch import "/home/opam/.opam/4.14/.opam-switch/backup/state-20240129184742.export"
'opam --cli=2.1 install mirage-solo5.0.6.2 topkg.1.0.7 solo5-bindings-hvt.0.6.9 ocplib-endian.1.2 ocamlfind.1.9.6 ocamlbuild.0.14.3 obuild.0.1.11 mirage-runtime.4.4.1 metrics.0.4.1 macaddr.5.5.0 lwt.5.7.0 logs.0.7.0 ipaddr.5.5.0 functoria-runtime.4.4.1 fmt.0.9.0 dune-configurator.3.13.0 dune.3.13.0 domain-name.0.4.0 cstruct.6.2.0 csexp.1.5.2 cppo.1.6.9 conf-pkg-config.2 conf-libseccomp.1 cmdliner.1.2.0 bheap.1.0.0 base-bytes.base --verbose --yes --confirm-level=unsafe-yes' failed.
OCaml

Innovation. Community. Security.